{"text_format":"1","workbook":"xlsx","n_sheets":3,"sheets":["Vorgaben","Klassenkurse","PDF Stufe 1"],"not_rendered":{"charts":0,"images":0,"macros":1,"external_links":0,"defined_names":2,"comments":0,"pivot_tables":0},"unopened":[],"bounds":{"document_bytes":16777216,"sheet_cells":100000,"rows_first":2000,"rows_last":500,"rows_between":2000,"halvings":0,"cell_chars":16384,"cell_head_chars":4096},"cells_cut":0,"cells_raw":0,"read":"whole","date_system":"1900"}

{"sheet":"Vorgaben","index":0,"n_rows":30,"n_cols":9,"rows_kept":30,"cut":false,"hidden":false,"merged":[[1,4,1,7],[21,1,22,3],[23,1,24,9]]}
["Vorgabenseite",null,null,"Sie brauchen nur diese Seite zu füllen, die restlichen Tabellenblätter füllen sich dann passend für den Export."]
[null,"Verzeichnis oberhalb des Klassenordners"]
[null,"Unterricht","/","2020-21","/",null,"/"]
[null,"Stammverzeichnis",null,"z.B. Jahr"]
[null,null,null,"Sammelordner",null,"Klassenraumname",null,"ggf. Volagekurs","ggf. Passwort Klassenkurs "]
[null,"Jede Klasse kann",null,"Fuchsklasse (2020-21)",null,"Füchse Klassenraum",null,"2020-21_Vorlageklasse","Lehrer"]
[null,"einen unter-",null,"Fuchsklasse (2020-21)",null,"Füchse Englisch",null,"2020-21_Vorlageklasse","djv5456+"]
[null,"schiedlichen Ordner",null,"Entenklasse (2020-21)",null,"Enten Klassenraum",null,"2020-21_Vorlageklasse"]
[null,"erhalten, z.B. einen"]
[null,"Stufenordner."]
[null,"Sind alle Klassenräume",null,null,null,null,null,null,"ggf."]
[null,"in identischem",null,null,null,null,null,null,"Passwort Klassenkurs"]
[null,"Ordner, so kann ",null,null,null,null,null,null,"Schüler"]
[null,"dieser auch oben"]
[null,"in die Verzeichnis-"]
[null,"struktur aufgenommen"]
[null,"werden."]
[]
[]
[]
[]
[null,"Alle Szenarien"]
[]
[null,"Klassen mit Einzelnamen und freien Verzeichnisnamen"]
[]
[]
[null,"Hinweise"]
[null,"Sollen die Klassen in die Stufenordner einsortiert werden, muss der gelbe Bereich ausgefüllt werden."]
[null,"Für jede Klasse muss auch der Stufenname angegeben sein."]
[null,"Die Exportdatei wird über das Tabellenblatt \"Klassenkurse\" erzeugt."]

{"sheet":"Klassenkurse","index":1,"n_rows":15,"n_cols":10,"rows_kept":15,"cut":false,"hidden":false,"merged":[]}
["shortname","fullname","category_path","templatecourse","enrolment_1","enrolment_1_role","enrolment_1_password","enrolement_2","enrolement_2_role","enrolement_2_passwort"]
[{"$f":"IF(Vorgaben!F6=\"\",\"\",Vorgaben!F6)","v":"Füchse Klassenraum"},{"$f":"IF(OR(Vorgaben!$F$6=\"\",),\"\",A2)","v":"Füchse Klassenraum"},{"$f":"IF(A2=\"\",\"\",IF(Vorgaben!$B$3=\"\",\"\",Vorgaben!$B$3&\" / \")&IF(Vorgaben!$D$3=\"\",\"\",Vorgaben!$D$3&\" / \")&IF(Vorgaben!$F$3=\"\",\"\",Vorgaben!$F$3&\" / \")&IF(Vorgaben!$H$3=\"\",\"\",Vorgaben!$H$3&\" / \")&Vorgaben!D6)","v":"Unterricht / 2020-21 / Fuchsklasse (2020-21)"},{"$f":"IF(OR($A2=\"\",Vorgaben!$H6=\"\"),\"\",Vorgaben!$H6)","v":"2020-21_Vorlageklasse"},{"$f":"IF(OR($A2=\"\",Vorgaben!$I$7=\"\"),\"\",\"self\")","v":"self"},{"$f":"IF(OR($A2=\"\",Vorgaben!$I$7=\"\"),\"\",\"editingteacher\")","v":"editingteacher"},{"$f":"IF(OR($A2=\"\",Vorgaben!$I$7=\"\"),\"\",Vorgaben!$I$7)","v":"djv5456+"},{"$f":"IF(OR($A2=\"\",Vorgaben!$I$14=\"\"),\"\",\"self\")","v":""},{"$f":"IF(OR($A2=\"\",Vorgaben!$I$14=\"\"),\"\",\"student\")","v":""},{"$f":"IF(OR($A2=\"\",Vorgaben!$I$14=\"\"),\"\",Vorgaben!$I$14)","v":""}]
[{"$f":"IF(Vorgaben!F7=\"\",\"\",Vorgaben!F7)","v":"Füchse Englisch"},{"$f":"IF(OR(Vorgaben!$F$6=\"\",),\"\",A3)","v":"Füchse Englisch"},{"$f":"IF(A3=\"\",\"\",IF(Vorgaben!$B$3=\"\",\"\",Vorgaben!$B$3&\" / \")&IF(Vorgaben!$D$3=\"\",\"\",Vorgaben!$D$3&\" / \")&IF(Vorgaben!$F$3=\"\",\"\",Vorgaben!$F$3&\" / \")&IF(Vorgaben!$H$3=\"\",\"\",Vorgaben!$H$3&\" / \")&Vorgaben!D7)","v":"Unterricht / 2020-21 / Fuchsklasse (2020-21)"},{"$f":"IF(OR($A3=\"\",Vorgaben!$H7=\"\"),\"\",Vorgaben!$H7)","v":"2020-21_Vorlageklasse"},{"$f":"IF(OR($A3=\"\",Vorgaben!$I$7=\"\"),\"\",$E$2)","v":"self"},{"$f":"IF(OR($A3=\"\",Vorgaben!$I$7=\"\"),\"\",\"editingteacher\")","v":"editingteacher"},{"$f":"IF(OR($A3=\"\",Vorgaben!$I$7=\"\"),\"\",Vorgaben!$I$7)","v":"djv5456+"},{"$f":"IF(OR($A3=\"\",Vorgaben!$I$14=\"\"),\"\",\"self\")","v":""},{"$f":"IF(OR($A3=\"\",Vorgaben!$I$14=\"\"),\"\",\"student\")","v":""},{"$f":"IF(OR($A3=\"\",Vorgaben!$I$14=\"\"),\"\",Vorgaben!$I$14)","v":""}]
[{"$f":"IF(Vorgaben!F8=\"\",\"\",Vorgaben!F8)","v":"Enten Klassenraum"},{"$f":"IF(OR(Vorgaben!$F$6=\"\",),\"\",A4)","v":"Enten Klassenraum"},{"$f":"IF(A4=\"\",\"\",IF(Vorgaben!$B$3=\"\",\"\",Vorgaben!$B$3&\" / \")&IF(Vorgaben!$D$3=\"\",\"\",Vorgaben!$D$3&\" / \")&IF(Vorgaben!$F$3=\"\",\"\",Vorgaben!$F$3&\" / \")&IF(Vorgaben!$H$3=\"\",\"\",Vorgaben!$H$3&\" / \")&Vorgaben!D8)","v":"Unterricht / 2020-21 / Entenklasse (2020-21)"},{"$f":"IF(OR($A4=\"\",Vorgaben!$H8=\"\"),\"\",Vorgaben!$H8)","v":"2020-21_Vorlageklasse"},{"$f":"IF(OR($A4=\"\",Vorgaben!$I$7=\"\"),\"\",$E$2)","v":"self"},{"$f":"IF(OR($A4=\"\",Vorgaben!$I$7=\"\"),\"\",\"editingteacher\")","v":"editingteacher"},{"$f":"IF(OR($A4=\"\",Vorgaben!$I$7=\"\"),\"\",Vorgaben!$I$7)","v":"djv5456+"},{"$f":"IF(OR($A4=\"\",Vorgaben!$I$14=\"\"),\"\",\"self\")","v":""},{"$f":"IF(OR($A4=\"\",Vorgaben!$I$14=\"\"),\"\",\"student\")","v":""},{"$f":"IF(OR($A4=\"\",Vorgaben!$I$14=\"\"),\"\",Vorgaben!$I$14)","v":""}]
[{"$f":"IF(Vorgaben!F9=\"\",\"\",Vorgaben!F9)","v":""},{"$f":"IF(OR(Vorgaben!$F$6=\"\",),\"\",A5)","v":""},{"$f":"IF(A5=\"\",\"\",IF(Vorgaben!$B$3=\"\",\"\",Vorgaben!$B$3&\" / \")&IF(Vorgaben!$D$3=\"\",\"\",Vorgaben!$D$3&\" / \")&IF(Vorgaben!$F$3=\"\",\"\",Vorgaben!$F$3&\" / \")&IF(Vorgaben!$H$3=\"\",\"\",Vorgaben!$H$3&\" / \")&Vorgaben!D9)","v":""},{"$f":"IF(OR($A5=\"\",Vorgaben!$H9=\"\"),\"\",Vorgaben!$H9)","v":""},{"$f":"IF(OR($A5=\"\",Vorgaben!$I$7=\"\"),\"\",$E$2)","v":""},{"$f":"IF(OR($A5=\"\",Vorgaben!$I$7=\"\"),\"\",\"editingteacher\")","v":""},{"$f":"IF(OR($A5=\"\",Vorgaben!$I$7=\"\"),\"\",Vorgaben!$I$7)","v":""},{"$f":"IF(OR($A5=\"\",Vorgaben!$I$14=\"\"),\"\",\"self\")","v":""},{"$f":"IF(OR($A5=\"\",Vorgaben!$I$14=\"\"),\"\",\"student\")","v":""},{"$f":"IF(OR($A5=\"\",Vorgaben!$I$14=\"\"),\"\",Vorgaben!$I$14)","v":""}]
[{"$f":"IF(Vorgaben!F10=\"\",\"\",Vorgaben!F10)","v":""},{"$f":"IF(OR(Vorgaben!$F$6=\"\",),\"\",A6)","v":""},{"$f":"IF(A6=\"\",\"\",IF(Vorgaben!$B$3=\"\",\"\",Vorgaben!$B$3&\" / \")&IF(Vorgaben!$D$3=\"\",\"\",Vorgaben!$D$3&\" / \")&IF(Vorgaben!$F$3=\"\",\"\",Vorgaben!$F$3&\" / \")&IF(Vorgaben!$H$3=\"\",\"\",Vorgaben!$H$3&\" / \")&Vorgaben!D10)","v":""},{"$f":"IF(OR($A6=\"\",Vorgaben!$H10=\"\"),\"\",Vorgaben!$H10)","v":""},{"$f":"IF(OR($A6=\"\",Vorgaben!$I$7=\"\"),\"\",$E$2)","v":""},{"$f":"IF(OR($A6=\"\",Vorgaben!$I$7=\"\"),\"\",\"editingteacher\")","v":""},{"$f":"IF(OR($A6=\"\",Vorgaben!$I$7=\"\"),\"\",Vorgaben!$I$7)","v":""},{"$f":"IF(OR($A6=\"\",Vorgaben!$I$14=\"\"),\"\",\"self\")","v":""},{"$f":"IF(OR($A6=\"\",Vorgaben!$I$14=\"\"),\"\",\"student\")","v":""},{"$f":"IF(OR($A6=\"\",Vorgaben!$I$14=\"\"),\"\",Vorgaben!$I$14)","v":""}]
[{"$f":"IF(Vorgaben!F11=\"\",\"\",Vorgaben!F11)","v":""},{"$f":"IF(OR(Vorgaben!$F$6=\"\",),\"\",A7)","v":""},{"$f":"IF(A7=\"\",\"\",IF(Vorgaben!$B$3=\"\",\"\",Vorgaben!$B$3&\" / \")&IF(Vorgaben!$D$3=\"\",\"\",Vorgaben!$D$3&\" / \")&IF(Vorgaben!$F$3=\"\",\"\",Vorgaben!$F$3&\" / \")&IF(Vorgaben!$H$3=\"\",\"\",Vorgaben!$H$3&\" / \")&Vorgaben!D11)","v":""},{"$f":"IF(OR($A7=\"\",Vorgaben!$H11=\"\"),\"\",Vorgaben!$H11)","v":""},{"$f":"IF(OR($A7=\"\",Vorgaben!$I$7=\"\"),\"\",$E$2)","v":""},{"$f":"IF(OR($A7=\"\",Vorgaben!$I$7=\"\"),\"\",\"editingteacher\")","v":""},{"$f":"IF(OR($A7=\"\",Vorgaben!$I$7=\"\"),\"\",Vorgaben!$I$7)","v":""},{"$f":"IF(OR($A7=\"\",Vorgaben!$I$14=\"\"),\"\",\"self\")","v":""},{"$f":"IF(OR($A7=\"\",Vorgaben!$I$14=\"\"),\"\",\"student\")","v":""},{"$f":"IF(OR($A7=\"\",Vorgaben!$I$14=\"\"),\"\",Vorgaben!$I$14)","v":""}]
[{"$f":"IF(Vorgaben!F12=\"\",\"\",Vorgaben!F12)","v":""},{"$f":"IF(OR(Vorgaben!$F$6=\"\",),\"\",A8)","v":""},{"$f":"IF(A8=\"\",\"\",IF(Vorgaben!$B$3=\"\",\"\",Vorgaben!$B$3&\" / \")&IF(Vorgaben!$D$3=\"\",\"\",Vorgaben!$D$3&\" / \")&IF(Vorgaben!$F$3=\"\",\"\",Vorgaben!$F$3&\" / \")&IF(Vorgaben!$H$3=\"\",\"\",Vorgaben!$H$3&\" / \")&Vorgaben!D12)","v":""},{"$f":"IF(OR($A8=\"\",Vorgaben!$H12=\"\"),\"\",Vorgaben!$H12)","v":""},{"$f":"IF(OR($A8=\"\",Vorgaben!$I$7=\"\"),\"\",$E$2)","v":""},{"$f":"IF(OR($A8=\"\",Vorgaben!$I$7=\"\"),\"\",\"editingteacher\")","v":""},{"$f":"IF(OR($A8=\"\",Vorgaben!$I$7=\"\"),\"\",Vorgaben!$I$7)","v":""},{"$f":"IF(OR($A8=\"\",Vorgaben!$I$14=\"\"),\"\",\"self\")","v":""},{"$f":"IF(OR($A8=\"\",Vorgaben!$I$14=\"\"),\"\",\"student\")","v":""},{"$f":"IF(OR($A8=\"\",Vorgaben!$I$14=\"\"),\"\",Vorgaben!$I$14)","v":""}]
[{"$f":"IF(Vorgaben!F13=\"\",\"\",Vorgaben!F13)","v":""},{"$f":"IF(OR(Vorgaben!$F$6=\"\",),\"\",A9)","v":""},{"$f":"IF(A9=\"\",\"\",IF(Vorgaben!$B$3=\"\",\"\",Vorgaben!$B$3&\" / \")&IF(Vorgaben!$D$3=\"\",\"\",Vorgaben!$D$3&\" / \")&IF(Vorgaben!$F$3=\"\",\"\",Vorgaben!$F$3&\" / \")&IF(Vorgaben!$H$3=\"\",\"\",Vorgaben!$H$3&\" / \")&Vorgaben!D13)","v":""},{"$f":"IF(OR($A9=\"\",Vorgaben!$H13=\"\"),\"\",Vorgaben!$H13)","v":""},{"$f":"IF(OR($A9=\"\",Vorgaben!$I$7=\"\"),\"\",$E$2)","v":""},{"$f":"IF(OR($A9=\"\",Vorgaben!$I$7=\"\"),\"\",\"editingteacher\")","v":""},{"$f":"IF(OR($A9=\"\",Vorgaben!$I$7=\"\"),\"\",Vorgaben!$I$7)","v":""},{"$f":"IF(OR($A9=\"\",Vorgaben!$I$14=\"\"),\"\",\"self\")","v":""},{"$f":"IF(OR($A9=\"\",Vorgaben!$I$14=\"\"),\"\",\"student\")","v":""},{"$f":"IF(OR($A9=\"\",Vorgaben!$I$14=\"\"),\"\",Vorgaben!$I$14)","v":""}]
[{"$f":"IF(Vorgaben!F14=\"\",\"\",Vorgaben!F14)","v":""},{"$f":"IF(OR(Vorgaben!$F$6=\"\",),\"\",A10)","v":""},{"$f":"IF(A10=\"\",\"\",IF(Vorgaben!$B$3=\"\",\"\",Vorgaben!$B$3&\" / \")&IF(Vorgaben!$D$3=\"\",\"\",Vorgaben!$D$3&\" / \")&IF(Vorgaben!$F$3=\"\",\"\",Vorgaben!$F$3&\" / \")&IF(Vorgaben!$H$3=\"\",\"\",Vorgaben!$H$3&\" / \")&Vorgaben!D14)","v":""},{"$f":"IF(OR($A10=\"\",Vorgaben!$H14=\"\"),\"\",Vorgaben!$H14)","v":""},{"$f":"IF(OR($A10=\"\",Vorgaben!$I$7=\"\"),\"\",$E$2)","v":""},{"$f":"IF(OR($A10=\"\",Vorgaben!$I$7=\"\"),\"\",\"editingteacher\")","v":""},{"$f":"IF(OR($A10=\"\",Vorgaben!$I$7=\"\"),\"\",Vorgaben!$I$7)","v":""},{"$f":"IF(OR($A10=\"\",Vorgaben!$I$14=\"\"),\"\",\"self\")","v":""},{"$f":"IF(OR($A10=\"\",Vorgaben!$I$14=\"\"),\"\",\"student\")","v":""},{"$f":"IF(OR($A10=\"\",Vorgaben!$I$14=\"\"),\"\",Vorgaben!$I$14)","v":""}]
[{"$f":"IF(Vorgaben!F15=\"\",\"\",Vorgaben!F15)","v":""},{"$f":"IF(OR(Vorgaben!$F$6=\"\",),\"\",A11)","v":""},{"$f":"IF(A11=\"\",\"\",IF(Vorgaben!$B$3=\"\",\"\",Vorgaben!$B$3&\" / \")&IF(Vorgaben!$D$3=\"\",\"\",Vorgaben!$D$3&\" / \")&IF(Vorgaben!$F$3=\"\",\"\",Vorgaben!$F$3&\" / \")&IF(Vorgaben!$H$3=\"\",\"\",Vorgaben!$H$3&\" / \")&Vorgaben!D15)","v":""},{"$f":"IF(OR($A11=\"\",Vorgaben!$H15=\"\"),\"\",Vorgaben!$H15)","v":""},{"$f":"IF(OR($A11=\"\",Vorgaben!$I$7=\"\"),\"\",$E$2)","v":""},{"$f":"IF(OR($A11=\"\",Vorgaben!$I$7=\"\"),\"\",\"editingteacher\")","v":""},{"$f":"IF(OR($A11=\"\",Vorgaben!$I$7=\"\"),\"\",Vorgaben!$I$7)","v":""},{"$f":"IF(OR($A11=\"\",Vorgaben!$I$14=\"\"),\"\",\"self\")","v":""},{"$f":"IF(OR($A11=\"\",Vorgaben!$I$14=\"\"),\"\",\"student\")","v":""},{"$f":"IF(OR($A11=\"\",Vorgaben!$I$14=\"\"),\"\",Vorgaben!$I$14)","v":""}]
[{"$f":"IF(Vorgaben!F16=\"\",\"\",Vorgaben!F16)","v":""},{"$f":"IF(OR(Vorgaben!$F$6=\"\",),\"\",A12)","v":""},{"$f":"IF(A12=\"\",\"\",IF(Vorgaben!$B$3=\"\",\"\",Vorgaben!$B$3&\" / \")&IF(Vorgaben!$D$3=\"\",\"\",Vorgaben!$D$3&\" / \")&IF(Vorgaben!$F$3=\"\",\"\",Vorgaben!$F$3&\" / \")&IF(Vorgaben!$H$3=\"\",\"\",Vorgaben!$H$3&\" / \")&Vorgaben!D16)","v":""},{"$f":"IF(OR($A12=\"\",Vorgaben!$H16=\"\"),\"\",Vorgaben!$H16)","v":""},{"$f":"IF(OR($A12=\"\",Vorgaben!$I$7=\"\"),\"\",$E$2)","v":""},{"$f":"IF(OR($A12=\"\",Vorgaben!$I$7=\"\"),\"\",\"editingteacher\")","v":""},{"$f":"IF(OR($A12=\"\",Vorgaben!$I$7=\"\"),\"\",Vorgaben!$I$7)","v":""},{"$f":"IF(OR($A12=\"\",Vorgaben!$I$14=\"\"),\"\",\"self\")","v":""},{"$f":"IF(OR($A12=\"\",Vorgaben!$I$14=\"\"),\"\",\"student\")","v":""},{"$f":"IF(OR($A12=\"\",Vorgaben!$I$14=\"\"),\"\",Vorgaben!$I$14)","v":""}]
[{"$f":"IF(Vorgaben!F17=\"\",\"\",Vorgaben!F17)","v":""},{"$f":"IF(OR(Vorgaben!$F$6=\"\",),\"\",A13)","v":""},{"$f":"IF(A13=\"\",\"\",IF(Vorgaben!$B$3=\"\",\"\",Vorgaben!$B$3&\" / \")&IF(Vorgaben!$D$3=\"\",\"\",Vorgaben!$D$3&\" / \")&IF(Vorgaben!$F$3=\"\",\"\",Vorgaben!$F$3&\" / \")&IF(Vorgaben!$H$3=\"\",\"\",Vorgaben!$H$3&\" / \")&Vorgaben!D17)","v":""},{"$f":"IF(OR($A13=\"\",Vorgaben!$H17=\"\"),\"\",Vorgaben!$H17)","v":""},{"$f":"IF(OR($A13=\"\",Vorgaben!$I$7=\"\"),\"\",$E$2)","v":""},{"$f":"IF(OR($A13=\"\",Vorgaben!$I$7=\"\"),\"\",\"editingteacher\")","v":""},{"$f":"IF(OR($A13=\"\",Vorgaben!$I$7=\"\"),\"\",Vorgaben!$I$7)","v":""},{"$f":"IF(OR($A13=\"\",Vorgaben!$I$14=\"\"),\"\",\"self\")","v":""},{"$f":"IF(OR($A13=\"\",Vorgaben!$I$14=\"\"),\"\",\"student\")","v":""},{"$f":"IF(OR($A13=\"\",Vorgaben!$I$14=\"\"),\"\",Vorgaben!$I$14)","v":""}]
[{"$f":"IF(Vorgaben!F18=\"\",\"\",Vorgaben!F18)","v":""},{"$f":"IF(OR(Vorgaben!$F$6=\"\",),\"\",A14)","v":""},{"$f":"IF(A14=\"\",\"\",IF(Vorgaben!$B$3=\"\",\"\",Vorgaben!$B$3&\" / \")&IF(Vorgaben!$D$3=\"\",\"\",Vorgaben!$D$3&\" / \")&IF(Vorgaben!$F$3=\"\",\"\",Vorgaben!$F$3&\" / \")&IF(Vorgaben!$H$3=\"\",\"\",Vorgaben!$H$3&\" / \")&Vorgaben!D18)","v":""},{"$f":"IF(OR($A14=\"\",Vorgaben!$H18=\"\"),\"\",Vorgaben!$H18)","v":""},{"$f":"IF(OR($A14=\"\",Vorgaben!$I$7=\"\"),\"\",$E$2)","v":""},{"$f":"IF(OR($A14=\"\",Vorgaben!$I$7=\"\"),\"\",\"editingteacher\")","v":""},{"$f":"IF(OR($A14=\"\",Vorgaben!$I$7=\"\"),\"\",Vorgaben!$I$7)","v":""},{"$f":"IF(OR($A14=\"\",Vorgaben!$I$14=\"\"),\"\",\"self\")","v":""},{"$f":"IF(OR($A14=\"\",Vorgaben!$I$14=\"\"),\"\",\"student\")","v":""},{"$f":"IF(OR($A14=\"\",Vorgaben!$I$14=\"\"),\"\",Vorgaben!$I$14)","v":""}]
[{"$f":"IF(Vorgaben!F19=\"\",\"\",Vorgaben!F19)","v":""},{"$f":"IF(OR(Vorgaben!$F$6=\"\",),\"\",A15)","v":""},{"$f":"IF(A15=\"\",\"\",IF(Vorgaben!$B$3=\"\",\"\",Vorgaben!$B$3&\" / \")&IF(Vorgaben!$D$3=\"\",\"\",Vorgaben!$D$3&\" / \")&IF(Vorgaben!$F$3=\"\",\"\",Vorgaben!$F$3&\" / \")&IF(Vorgaben!$H$3=\"\",\"\",Vorgaben!$H$3&\" / \")&Vorgaben!D19)","v":""},{"$f":"IF(OR($A15=\"\",Vorgaben!$H19=\"\"),\"\",Vorgaben!$H19)","v":""},{"$f":"IF(OR($A15=\"\",Vorgaben!$I$7=\"\"),\"\",$E$2)","v":""},{"$f":"IF(OR($A15=\"\",Vorgaben!$I$7=\"\"),\"\",\"editingteacher\")","v":""},{"$f":"IF(OR($A15=\"\",Vorgaben!$I$7=\"\"),\"\",Vorgaben!$I$7)","v":""},{"$f":"IF(OR($A15=\"\",Vorgaben!$I$14=\"\"),\"\",\"self\")","v":""},{"$f":"IF(OR($A15=\"\",Vorgaben!$I$14=\"\"),\"\",\"student\")","v":""},{"$f":"IF(OR($A15=\"\",Vorgaben!$I$14=\"\"),\"\",Vorgaben!$I$14)","v":""}]

{"sheet":"PDF Stufe 1","index":2,"n_rows":9,"n_cols":3,"rows_kept":9,"cut":false,"hidden":false,"merged":[[0,1,0,2]]}
[{"$f":"\"Klassenkurse der Stufe \"&Vorgaben!D6","v":"Klassenkurse der Stufe Fuchsklasse (2020-21)"},"Sind Passwörter angegeben, so wurde der Kurs mit der Möglichkeit der Selbsteinschreibung importiert."]
["Klassenkursname ","Passwort Lehrer/in","Passwort Schüler/in"]
[{"$f":"IF(Klassenkurse!A2<>\"\",Klassenkurse!A2,\"\")","v":"Füchse Klassenraum"},{"$f":"IF(Klassenkurse!G2<>\"\",Klassenkurse!G2,\"\")","v":"djv5456+"},{"$f":"IF(Klassenkurse!J2<>\"\",Klassenkurse!J2,\"\")","v":""}]
[{"$f":"IF(Klassenkurse!A3<>\"\",Klassenkurse!A3,\"\")","v":"Füchse Englisch"},{"$f":"IF(Klassenkurse!G3<>\"\",Klassenkurse!G3,\"\")","v":"djv5456+"},{"$f":"IF(Klassenkurse!J3<>\"\",Klassenkurse!J3,\"\")","v":""}]
[{"$f":"IF(Klassenkurse!A4<>\"\",Klassenkurse!A4,\"\")","v":"Enten Klassenraum"},{"$f":"IF(Klassenkurse!G4<>\"\",Klassenkurse!G4,\"\")","v":"djv5456+"},{"$f":"IF(Klassenkurse!J4<>\"\",Klassenkurse!J4,\"\")","v":""}]
[{"$f":"IF(Klassenkurse!A5<>\"\",Klassenkurse!A5,\"\")","v":""},{"$f":"IF(Klassenkurse!G5<>\"\",Klassenkurse!G5,\"\")","v":""},{"$f":"IF(Klassenkurse!J5<>\"\",Klassenkurse!J5,\"\")","v":""}]
[{"$f":"IF(Klassenkurse!A6<>\"\",Klassenkurse!A6,\"\")","v":""},{"$f":"IF(Klassenkurse!G6<>\"\",Klassenkurse!G6,\"\")","v":""},{"$f":"IF(Klassenkurse!J6<>\"\",Klassenkurse!J6,\"\")","v":""}]
[{"$f":"IF(Klassenkurse!A7<>\"\",Klassenkurse!A7,\"\")","v":""},{"$f":"IF(Klassenkurse!G7<>\"\",Klassenkurse!G7,\"\")","v":""},{"$f":"IF(Klassenkurse!J7<>\"\",Klassenkurse!J7,\"\")","v":""}]
[{"$f":"IF(Klassenkurse!A8<>\"\",Klassenkurse!A8,\"\")","v":""},{"$f":"IF(Klassenkurse!G8<>\"\",Klassenkurse!G8,\"\")","v":""},{"$f":"IF(Klassenkurse!J8<>\"\",Klassenkurse!J8,\"\")","v":""}]