{"text_format":"1","workbook":"xlsx","n_sheets":10,"sheets":["Vorgaben","Klassenkurse","Diffkurse","PDF Diffkurse","PDF Stufe 1","PDF Stufe 2","PDF Stufe 3","PDF Stufe 4","PDF Stufe 5","PDF Stufee 6"],"not_rendered":{"charts":0,"images":0,"macros":1,"external_links":0,"defined_names":9,"comments":0,"pivot_tables":0},"unopened":[],"bounds":{"document_bytes":16777216,"sheet_cells":100000,"rows_first":2000,"rows_last":500,"rows_between":2000,"halvings":0,"cell_chars":16384,"cell_head_chars":4096},"cells_cut":0,"cells_raw":0,"read":"whole","date_system":"1900"}

{"sheet":"Vorgaben","index":0,"n_rows":18,"n_cols":15,"rows_kept":18,"cut":false,"hidden":false,"merged":[[1,4,1,7],[15,1,16,3],[17,1,18,3]]}
["Vorgabenseite",null,null,"Sie brauchen nur diese Seite zu füllen, die restlichen Tabellenblätter füllen sich dann passend für den Export."]
[null,"Verzeichnis oberhalb des Klassenordners",null,null,"Das Verzeichnis für die Klasse wird automatisch angehängt\n(= Klassenbezeichnung). Dieses bitte hier nicht angeben."]
[null,"Unterricht","/","2020-21","/",null,"/"]
[null,"Stammverzeichnis",null,"z.B. Jahr",null,null,null,null,null,null,null,null,null,null,"ggf. Kurspasswörter"]
[null,"Schuljahr",null,"Stufenordner",null,"Klassename","Klassennr.","ggf. Volagekurs","ggf. Passwort Klassenkurs ",null,"Stufenordner","Kursname","ggf. Vorlagekurs","Passwort Kurs","Schüler"]
[null,null,null,"Stufe 05",null,"Klasse 5","a","VorlageKlasse1b","Lehrer",null,"Stufe 5","Diffkurs","VorlageDiff1b","Lehrer","diff#05"]
[null,null,null,"Stufe 06",null,"Klasse 6","b","VorlageKlasse1b","djv5456+",null,null,null,"VorlageDiff1b","djv5456+","diff#06"]
[null,null,null,"Stufe 07",null,"Klasse 7","c","VorlageKlasse1b",null,null,null,null,"VorlageDiff1b",null,"diff#07"]
[null," ",null,null,null,null,"d","VorlageKlasse1b",null,null,null,null,null,"Um Fremdein-","diff#08"]
[null,null,null,null,null,null,null,null,null,null,null,null,null,"schreibung zu","diff#09"]
[null,null,null,null,null,null,null,null,"ggf.",null,null,null,null,"verhindern, ist für","diff#10"]
[null,null,null,null,null,null,null,null,"Passwort Klassenkurs",null,null,null,null,"Schüler ein Passwort"]
[null,null,null,null,null,null,null,null,"Schüler",null,null,null,null,"je Kurs empfophlen"]
[]
[]
[null,"Szenario 1b"]
[]
[null,"Sekundarstufe I"]

{"sheet":"Klassenkurse","index":1,"n_rows":24,"n_cols":10,"rows_kept":24,"cut":false,"hidden":false,"merged":[]}
["shortname","fullname","category_path","templatecourse","enrolment_1","enrolment_1_role","enrolment_1_password","enrolement_2","enrolement_2_role","enrolement_2_passwort"]
[{"$f":"IF(OR(Vorgaben!$F$6=\"\",Vorgaben!$G6=\"\"),\"\",IF(Vorgaben!$B$6=\"\",Vorgaben!$F$6&Vorgaben!$G6,Vorgaben!$B$6&\" \"&Vorgaben!$F$6&Vorgaben!$G6))","v":"Klasse 5a"},{"$f":"A2","v":"Klasse 5a"},{"$f":"IF(A2=\"\",\"\",IF(Vorgaben!$B$3=\"\",\"\",Vorgaben!$B$3&\" / \")&IF(Vorgaben!$D$3=\"\",\"\",Vorgaben!$D$3&\" / \")&IF(Vorgaben!$F$3=\"\",\"\",Vorgaben!$F$3&\" / \")&IF(Vorgaben!$H$3=\"\",\"\",Vorgaben!$H$3&\" / \")&IF(Vorgaben!$B$6=\"\",Vorgaben!D6,Vorgaben!D6&\" (\"&Vorgaben!$B$6&\")\"))","v":"Unterricht / 2020-21 / Stufe 05"},{"$f":"IF(OR($A2=\"\",Vorgaben!$H6=\"\"),\"\",Vorgaben!$H6)","v":"VorlageKlasse1b"},{"$f":"IF(OR($A2=\"\",Vorgaben!$I$7=\"\"),\"\",\"self\")","v":"self"},{"$f":"IF(OR($A2=\"\",Vorgaben!$I$7=\"\"),\"\",\"editingteacher\")","v":"editingteacher"},{"$f":"IF(OR($A2=\"\",Vorgaben!$I$7=\"\"),\"\",Vorgaben!$I$7)","v":"djv5456+"},{"$f":"IF(OR($A2=\"\",Vorgaben!$I$14=\"\"),\"\",\"self\")","v":""},{"$f":"IF(OR($A2=\"\",Vorgaben!$I$14=\"\"),\"\",\"student\")","v":""},{"$f":"IF(OR($A2=\"\",Vorgaben!$I$14=\"\"),\"\",Vorgaben!$I$14)","v":""}]
[{"$f":"IF(OR(Vorgaben!$F$6=\"\",Vorgaben!$G7=\"\"),\"\",IF(Vorgaben!$B$6=\"\",Vorgaben!$F$6&Vorgaben!$G7,Vorgaben!$B$6&\" \"&Vorgaben!$F$6&Vorgaben!$G7))","v":"Klasse 5b"},{"$f":"A3","v":"Klasse 5b"},{"$f":"IF(OR(A3=\"\",B3=\"\"),\"\",$C$2)","v":"Unterricht / 2020-21 / Stufe 05"},{"$f":"IF(OR($A3=\"\",Vorgaben!$H7=\"\"),\"\",Vorgaben!$H7)","v":"VorlageKlasse1b"},{"$f":"IF(OR($A3=\"\",Vorgaben!$I$7=\"\"),\"\",$E$2)","v":"self"},{"$f":"IF(OR($A3=\"\",Vorgaben!$I$7=\"\"),\"\",\"editingteacher\")","v":"editingteacher"},{"$f":"IF(OR($A3=\"\",Vorgaben!$I$7=\"\"),\"\",Vorgaben!$I$7)","v":"djv5456+"},{"$f":"IF(OR($A3=\"\",Vorgaben!$I$14=\"\"),\"\",\"self\")","v":""},{"$f":"IF(OR($A3=\"\",Vorgaben!$I$14=\"\"),\"\",\"student\")","v":""},{"$f":"IF(OR($A3=\"\",Vorgaben!$I$14=\"\"),\"\",Vorgaben!$I$14)","v":""}]
[{"$f":"IF(OR(Vorgaben!$F$6=\"\",Vorgaben!$G8=\"\"),\"\",IF(Vorgaben!$B$6=\"\",Vorgaben!$F$6&Vorgaben!$G8,Vorgaben!$B$6&\" \"&Vorgaben!$F$6&Vorgaben!$G8))","v":"Klasse 5c"},"Klasse 5c",{"$f":"IF(OR(A4=\"\",B4=\"\"),\"\",$C$2)","v":"Unterricht / 2020-21 / Stufe 05"},{"$f":"IF(OR($A4=\"\",Vorgaben!$H8=\"\"),\"\",Vorgaben!$H8)","v":"VorlageKlasse1b"},{"$f":"IF(OR($A4=\"\",Vorgaben!$I$7=\"\"),\"\",$E$2)","v":"self"},{"$f":"IF(OR($A4=\"\",Vorgaben!$I$7=\"\"),\"\",\"editingteacher\")","v":"editingteacher"},{"$f":"IF(OR($A4=\"\",Vorgaben!$I$7=\"\"),\"\",Vorgaben!$I$7)","v":"djv5456+"},{"$f":"IF(OR($A4=\"\",Vorgaben!$I$14=\"\"),\"\",\"self\")","v":""},{"$f":"IF(OR($A4=\"\",Vorgaben!$I$14=\"\"),\"\",\"student\")","v":""},{"$f":"IF(OR($A4=\"\",Vorgaben!$I$14=\"\"),\"\",Vorgaben!$I$14)","v":""}]
[{"$f":"IF(OR(Vorgaben!$F$6=\"\",Vorgaben!$G9=\"\"),\"\",IF(Vorgaben!$B$6=\"\",Vorgaben!$F$6&Vorgaben!$G9,Vorgaben!$B$6&\" \"&Vorgaben!$F$6&Vorgaben!$G9))","v":"Klasse 5d"},"Klasse 5d","Unterricht / 2020-21 / Stufe 05",{"$f":"IF(OR($A5=\"\",Vorgaben!$H9=\"\"),\"\",Vorgaben!$H9)","v":"VorlageKlasse1b"},{"$f":"IF(OR($A5=\"\",Vorgaben!$I$7=\"\"),\"\",$E$2)","v":"self"},{"$f":"IF(OR($A5=\"\",Vorgaben!$I$7=\"\"),\"\",\"editingteacher\")","v":"editingteacher"},{"$f":"IF(OR($A5=\"\",Vorgaben!$I$7=\"\"),\"\",Vorgaben!$I$7)","v":"djv5456+"},{"$f":"IF(OR($A5=\"\",Vorgaben!$I$14=\"\"),\"\",\"self\")","v":""},{"$f":"IF(OR($A5=\"\",Vorgaben!$I$14=\"\"),\"\",\"student\")","v":""},{"$f":"IF(OR($A5=\"\",Vorgaben!$I$14=\"\"),\"\",Vorgaben!$I$14)","v":""}]
[{"$f":"IF(OR(Vorgaben!$F$6=\"\",Vorgaben!$G10=\"\"),\"\",IF(Vorgaben!$B$6=\"\",Vorgaben!$F$6&Vorgaben!$G10,Vorgaben!$B$6&\" \"&Vorgaben!$F$6&Vorgaben!$G10))","v":""},"","",{"$f":"IF(OR($A6=\"\",Vorgaben!$H10=\"\"),\"\",Vorgaben!$H10)","v":""},{"$f":"IF(OR($A6=\"\",Vorgaben!$I$7=\"\"),\"\",$E$2)","v":""},{"$f":"IF(OR($A6=\"\",Vorgaben!$I$7=\"\"),\"\",\"editingteacher\")","v":""},{"$f":"IF(OR($A6=\"\",Vorgaben!$I$7=\"\"),\"\",Vorgaben!$I$7)","v":""},{"$f":"IF(OR($A6=\"\",Vorgaben!$I$14=\"\"),\"\",\"self\")","v":""},{"$f":"IF(OR($A6=\"\",Vorgaben!$I$14=\"\"),\"\",\"student\")","v":""},{"$f":"IF(OR($A6=\"\",Vorgaben!$I$14=\"\"),\"\",Vorgaben!$I$14)","v":""}]
[{"$f":"IF(OR(Vorgaben!$F$6=\"\",Vorgaben!$G11=\"\"),\"\",IF(Vorgaben!$B$6=\"\",Vorgaben!$F$6&Vorgaben!$G11,Vorgaben!$B$6&\" \"&Vorgaben!$F$6&Vorgaben!$G11))","v":""},"","",{"$f":"IF(OR($A7=\"\",Vorgaben!$H11=\"\"),\"\",Vorgaben!$H11)","v":""},{"$f":"IF(OR($A7=\"\",Vorgaben!$I$7=\"\"),\"\",$E$2)","v":""},{"$f":"IF(OR($A7=\"\",Vorgaben!$I$7=\"\"),\"\",\"editingteacher\")","v":""},{"$f":"IF(OR($A7=\"\",Vorgaben!$I$7=\"\"),\"\",Vorgaben!$I$7)","v":""},{"$f":"IF(OR($A7=\"\",Vorgaben!$I$14=\"\"),\"\",\"self\")","v":""},{"$f":"IF(OR($A7=\"\",Vorgaben!$I$14=\"\"),\"\",\"student\")","v":""},{"$f":"IF(OR($A7=\"\",Vorgaben!$I$14=\"\"),\"\",Vorgaben!$I$14)","v":""}]
[{"$f":"IF(OR(Vorgaben!$F$6=\"\",Vorgaben!$G12=\"\"),\"\",IF(Vorgaben!$B$6=\"\",Vorgaben!$F$6&Vorgaben!$G12,Vorgaben!$B$6&\" \"&Vorgaben!$F$6&Vorgaben!$G12))","v":""},"","",{"$f":"IF(OR($A8=\"\",Vorgaben!$H12=\"\"),\"\",Vorgaben!$H12)","v":""},{"$f":"IF(OR($A8=\"\",Vorgaben!$I$7=\"\"),\"\",$E$2)","v":""},{"$f":"IF(OR($A8=\"\",Vorgaben!$I$7=\"\"),\"\",\"editingteacher\")","v":""},{"$f":"IF(OR($A8=\"\",Vorgaben!$I$7=\"\"),\"\",Vorgaben!$I$7)","v":""},{"$f":"IF(OR($A8=\"\",Vorgaben!$I$14=\"\"),\"\",\"self\")","v":""},{"$f":"IF(OR($A8=\"\",Vorgaben!$I$14=\"\"),\"\",\"student\")","v":""},{"$f":"IF(OR($A8=\"\",Vorgaben!$I$14=\"\"),\"\",Vorgaben!$I$14)","v":""}]
[]
[{"$f":"IF(OR(Vorgaben!$F$7=\"\",Vorgaben!$G6=\"\"),\"\",IF(Vorgaben!$B$6=\"\",Vorgaben!$F$7&Vorgaben!$G6,Vorgaben!$B$6&\" \"&Vorgaben!$F$7&Vorgaben!$G6))","v":"Klasse 6a"},{"$f":"A10","v":"Klasse 6a"},{"$f":"IF(A10=\"\",\"\",IF(Vorgaben!$B$3=\"\",\"\",Vorgaben!$B$3&\" / \")&IF(Vorgaben!$D$3=\"\",\"\",Vorgaben!$D$3&\" / \")&IF(Vorgaben!$F$3=\"\",\"\",Vorgaben!$F$3&\" / \")&IF(Vorgaben!$H$3=\"\",\"\",Vorgaben!$H$3&\" / \")&IF(Vorgaben!$B$6=\"\",Vorgaben!D7,Vorgaben!D7&\" (\"&Vorgaben!$B$6&\")\"))","v":"Unterricht / 2020-21 / Stufe 06"},{"$f":"IF(OR($A10=\"\",Vorgaben!$H6=\"\"),\"\",Vorgaben!$H6)","v":"VorlageKlasse1b"},{"$f":"IF(OR($A10=\"\",Vorgaben!$I$7=\"\"),\"\",$E$2)","v":"self"},{"$f":"IF(OR($A10=\"\",Vorgaben!$I$7=\"\"),\"\",\"editingteacher\")","v":"editingteacher"},{"$f":"IF(OR($A10=\"\",Vorgaben!$I$7=\"\"),\"\",Vorgaben!$I$7)","v":"djv5456+"},{"$f":"IF(OR($A10=\"\",Vorgaben!$I$14=\"\"),\"\",\"self\")","v":""},{"$f":"IF(OR($A10=\"\",Vorgaben!$I$14=\"\"),\"\",\"student\")","v":""},{"$f":"IF(OR($A10=\"\",Vorgaben!$I$14=\"\"),\"\",Vorgaben!$I$14)","v":""}]
[{"$f":"IF(OR(Vorgaben!$F$7=\"\",Vorgaben!$G7=\"\"),\"\",IF(Vorgaben!$B$6=\"\",Vorgaben!$F$7&Vorgaben!$G7,Vorgaben!$B$6&\" \"&Vorgaben!$F$7&Vorgaben!$G7))","v":"Klasse 6b"},{"$f":"A11","v":"Klasse 6b"},{"$f":"IF(OR(A11=\"\",B11=\"\"),\"\",$C$10)","v":"Unterricht / 2020-21 / Stufe 06"},{"$f":"IF(OR($A11=\"\",Vorgaben!$H7=\"\"),\"\",Vorgaben!$H7)","v":"VorlageKlasse1b"},{"$f":"IF(OR($A11=\"\",Vorgaben!$I$7=\"\"),\"\",$E$2)","v":"self"},{"$f":"IF(OR($A11=\"\",Vorgaben!$I$7=\"\"),\"\",\"editingteacher\")","v":"editingteacher"},{"$f":"IF(OR($A11=\"\",Vorgaben!$I$7=\"\"),\"\",Vorgaben!$I$7)","v":"djv5456+"},{"$f":"IF(OR($A11=\"\",Vorgaben!$I$14=\"\"),\"\",\"self\")","v":""},{"$f":"IF(OR($A11=\"\",Vorgaben!$I$14=\"\"),\"\",\"student\")","v":""},{"$f":"IF(OR($A11=\"\",Vorgaben!$I$14=\"\"),\"\",Vorgaben!$I$14)","v":""}]
[{"$f":"IF(OR(Vorgaben!$F$7=\"\",Vorgaben!$G8=\"\"),\"\",IF(Vorgaben!$B$6=\"\",Vorgaben!$F$7&Vorgaben!$G8,Vorgaben!$B$6&\" \"&Vorgaben!$F$7&Vorgaben!$G8))","v":"Klasse 6c"},"Klasse 6c",{"$f":"IF(OR(A12=\"\",B12=\"\"),\"\",$C$10)","v":"Unterricht / 2020-21 / Stufe 06"},{"$f":"IF(OR($A12=\"\",Vorgaben!$H8=\"\"),\"\",Vorgaben!$H8)","v":"VorlageKlasse1b"},{"$f":"IF(OR($A12=\"\",Vorgaben!$I$7=\"\"),\"\",$E$2)","v":"self"},{"$f":"IF(OR($A12=\"\",Vorgaben!$I$7=\"\"),\"\",\"editingteacher\")","v":"editingteacher"},{"$f":"IF(OR($A12=\"\",Vorgaben!$I$7=\"\"),\"\",Vorgaben!$I$7)","v":"djv5456+"},{"$f":"IF(OR($A12=\"\",Vorgaben!$I$14=\"\"),\"\",\"self\")","v":""},{"$f":"IF(OR($A12=\"\",Vorgaben!$I$14=\"\"),\"\",\"student\")","v":""},{"$f":"IF(OR($A12=\"\",Vorgaben!$I$14=\"\"),\"\",Vorgaben!$I$14)","v":""}]
[{"$f":"IF(OR(Vorgaben!$F$7=\"\",Vorgaben!$G9=\"\"),\"\",IF(Vorgaben!$B$6=\"\",Vorgaben!$F$7&Vorgaben!$G9,Vorgaben!$B$6&\" \"&Vorgaben!$F$7&Vorgaben!$G9))","v":"Klasse 6d"},"Klasse 6d","Unterricht / 2020-21 / Stufe 06",{"$f":"IF(OR($A13=\"\",Vorgaben!$H9=\"\"),\"\",Vorgaben!$H9)","v":"VorlageKlasse1b"},{"$f":"IF(OR($A13=\"\",Vorgaben!$I$7=\"\"),\"\",$E$2)","v":"self"},{"$f":"IF(OR($A13=\"\",Vorgaben!$I$7=\"\"),\"\",\"editingteacher\")","v":"editingteacher"},{"$f":"IF(OR($A13=\"\",Vorgaben!$I$7=\"\"),\"\",Vorgaben!$I$7)","v":"djv5456+"},{"$f":"IF(OR($A13=\"\",Vorgaben!$I$14=\"\"),\"\",\"self\")","v":""},{"$f":"IF(OR($A13=\"\",Vorgaben!$I$14=\"\"),\"\",\"student\")","v":""},{"$f":"IF(OR($A13=\"\",Vorgaben!$I$14=\"\"),\"\",Vorgaben!$I$14)","v":""}]
[{"$f":"IF(OR(Vorgaben!$F$7=\"\",Vorgaben!$G10=\"\"),\"\",IF(Vorgaben!$B$6=\"\",Vorgaben!$F$7&Vorgaben!$G10,Vorgaben!$B$6&\" \"&Vorgaben!$F$7&Vorgaben!$G10))","v":""},"","",{"$f":"IF(OR($A14=\"\",Vorgaben!$H10=\"\"),\"\",Vorgaben!$H10)","v":""},{"$f":"IF(OR($A14=\"\",Vorgaben!$I$7=\"\"),\"\",$E$2)","v":""},{"$f":"IF(OR($A14=\"\",Vorgaben!$I$7=\"\"),\"\",\"editingteacher\")","v":""},{"$f":"IF(OR($A14=\"\",Vorgaben!$I$7=\"\"),\"\",Vorgaben!$I$7)","v":""},{"$f":"IF(OR($A14=\"\",Vorgaben!$I$14=\"\"),\"\",\"self\")","v":""},{"$f":"IF(OR($A14=\"\",Vorgaben!$I$14=\"\"),\"\",\"student\")","v":""},{"$f":"IF(OR($A14=\"\",Vorgaben!$I$14=\"\"),\"\",Vorgaben!$I$14)","v":""}]
[{"$f":"IF(OR(Vorgaben!$F$7=\"\",Vorgaben!$G11=\"\"),\"\",IF(Vorgaben!$B$6=\"\",Vorgaben!$F$7&Vorgaben!$G11,Vorgaben!$B$6&\" \"&Vorgaben!$F$7&Vorgaben!$G11))","v":""},"","",{"$f":"IF(OR($A15=\"\",Vorgaben!$H11=\"\"),\"\",Vorgaben!$H11)","v":""},{"$f":"IF(OR($A15=\"\",Vorgaben!$I$7=\"\"),\"\",$E$2)","v":""},{"$f":"IF(OR($A15=\"\",Vorgaben!$I$7=\"\"),\"\",\"editingteacher\")","v":""},{"$f":"IF(OR($A15=\"\",Vorgaben!$I$7=\"\"),\"\",Vorgaben!$I$7)","v":""},{"$f":"IF(OR($A15=\"\",Vorgaben!$I$14=\"\"),\"\",\"self\")","v":""},{"$f":"IF(OR($A15=\"\",Vorgaben!$I$14=\"\"),\"\",\"student\")","v":""},{"$f":"IF(OR($A15=\"\",Vorgaben!$I$14=\"\"),\"\",Vorgaben!$I$14)","v":""}]
[{"$f":"IF(OR(Vorgaben!$F$7=\"\",Vorgaben!$G12=\"\"),\"\",IF(Vorgaben!$B$6=\"\",Vorgaben!$F$7&Vorgaben!$G12,Vorgaben!$B$6&\" \"&Vorgaben!$F$7&Vorgaben!$G12))","v":""},"","",{"$f":"IF(OR($A16=\"\",Vorgaben!$H12=\"\"),\"\",Vorgaben!$H12)","v":""},{"$f":"IF(OR($A16=\"\",Vorgaben!$I$7=\"\"),\"\",$E$2)","v":""},{"$f":"IF(OR($A16=\"\",Vorgaben!$I$7=\"\"),\"\",\"editingteacher\")","v":""},{"$f":"IF(OR($A16=\"\",Vorgaben!$I$7=\"\"),\"\",Vorgaben!$I$7)","v":""},{"$f":"IF(OR($A16=\"\",Vorgaben!$I$14=\"\"),\"\",\"self\")","v":""},{"$f":"IF(OR($A16=\"\",Vorgaben!$I$14=\"\"),\"\",\"student\")","v":""},{"$f":"IF(OR($A16=\"\",Vorgaben!$I$14=\"\"),\"\",Vorgaben!$I$14)","v":""}]
[]
[{"$f":"IF(OR(Vorgaben!$F$8=\"\",Vorgaben!$G6=\"\"),\"\",IF(Vorgaben!$B$6=\"\",Vorgaben!$F$8&Vorgaben!$G6,Vorgaben!$B$6&\" \"&Vorgaben!$F$8&Vorgaben!$G6))","v":"Klasse 7a"},{"$f":"A18","v":"Klasse 7a"},{"$f":"IF(A18=\"\",\"\",IF(Vorgaben!$B$3=\"\",\"\",Vorgaben!$B$3&\" / \")&IF(Vorgaben!$D$3=\"\",\"\",Vorgaben!$D$3&\" / \")&IF(Vorgaben!$F$3=\"\",\"\",Vorgaben!$F$3&\" / \")&IF(Vorgaben!$H$3=\"\",\"\",Vorgaben!$H$3&\" / \")&IF(Vorgaben!$B$6=\"\",Vorgaben!D8,Vorgaben!D8&\" (\"&Vorgaben!$B$6&\")\"))","v":"Unterricht / 2020-21 / Stufe 07"},{"$f":"IF(OR($A18=\"\",Vorgaben!$H6=\"\"),\"\",Vorgaben!$H6)","v":"VorlageKlasse1b"},{"$f":"IF(OR($A18=\"\",Vorgaben!$I$7=\"\"),\"\",$E$2)","v":"self"},{"$f":"IF(OR($A18=\"\",Vorgaben!$I$7=\"\"),\"\",\"editingteacher\")","v":"editingteacher"},{"$f":"IF(OR($A18=\"\",Vorgaben!$I$7=\"\"),\"\",Vorgaben!$I$7)","v":"djv5456+"},{"$f":"IF(OR($A18=\"\",Vorgaben!$I$14=\"\"),\"\",\"self\")","v":""},{"$f":"IF(OR($A18=\"\",Vorgaben!$I$14=\"\"),\"\",\"student\")","v":""},{"$f":"IF(OR($A18=\"\",Vorgaben!$I$14=\"\"),\"\",Vorgaben!$I$14)","v":""}]
[{"$f":"IF(OR(Vorgaben!$F$8=\"\",Vorgaben!$G7=\"\"),\"\",IF(Vorgaben!$B$6=\"\",Vorgaben!$F$8&Vorgaben!$G7,Vorgaben!$B$6&\" \"&Vorgaben!$F$8&Vorgaben!$G7))","v":"Klasse 7b"},{"$f":"A19","v":"Klasse 7b"},{"$f":"IF(OR(A19=\"\",B19=\"\"),\"\",$C$18)","v":"Unterricht / 2020-21 / Stufe 07"},{"$f":"IF(OR($A19=\"\",Vorgaben!$H7=\"\"),\"\",Vorgaben!$H7)","v":"VorlageKlasse1b"},{"$f":"IF(OR($A19=\"\",Vorgaben!$I$7=\"\"),\"\",$E$2)","v":"self"},{"$f":"IF(OR($A19=\"\",Vorgaben!$I$7=\"\"),\"\",\"editingteacher\")","v":"editingteacher"},{"$f":"IF(OR($A19=\"\",Vorgaben!$I$7=\"\"),\"\",Vorgaben!$I$7)","v":"djv5456+"},{"$f":"IF(OR($A19=\"\",Vorgaben!$I$14=\"\"),\"\",\"self\")","v":""},{"$f":"IF(OR($A19=\"\",Vorgaben!$I$14=\"\"),\"\",\"student\")","v":""},{"$f":"IF(OR($A19=\"\",Vorgaben!$I$14=\"\"),\"\",Vorgaben!$I$14)","v":""}]
[{"$f":"IF(OR(Vorgaben!$F$8=\"\",Vorgaben!$G8=\"\"),\"\",IF(Vorgaben!$B$6=\"\",Vorgaben!$F$8&Vorgaben!$G8,Vorgaben!$B$6&\" \"&Vorgaben!$F$8&Vorgaben!$G8))","v":"Klasse 7c"},"Klasse 7c",{"$f":"IF(OR(A20=\"\",B20=\"\"),\"\",$C$18)","v":"Unterricht / 2020-21 / Stufe 07"},{"$f":"IF(OR($A20=\"\",Vorgaben!$H8=\"\"),\"\",Vorgaben!$H8)","v":"VorlageKlasse1b"},{"$f":"IF(OR($A20=\"\",Vorgaben!$I$7=\"\"),\"\",$E$2)","v":"self"},{"$f":"IF(OR($A20=\"\",Vorgaben!$I$7=\"\"),\"\",\"editingteacher\")","v":"editingteacher"},{"$f":"IF(OR($A20=\"\",Vorgaben!$I$7=\"\"),\"\",Vorgaben!$I$7)","v":"djv5456+"},{"$f":"IF(OR($A20=\"\",Vorgaben!$I$14=\"\"),\"\",\"self\")","v":""},{"$f":"IF(OR($A20=\"\",Vorgaben!$I$14=\"\"),\"\",\"student\")","v":""},{"$f":"IF(OR($A20=\"\",Vorgaben!$I$14=\"\"),\"\",Vorgaben!$I$14)","v":""}]
[{"$f":"IF(OR(Vorgaben!$F$8=\"\",Vorgaben!$G9=\"\"),\"\",IF(Vorgaben!$B$6=\"\",Vorgaben!$F$8&Vorgaben!$G9,Vorgaben!$B$6&\" \"&Vorgaben!$F$8&Vorgaben!$G9))","v":"Klasse 7d"},"Klasse 7d","Unterricht / 2020-21 / Stufe 07",{"$f":"IF(OR($A21=\"\",Vorgaben!$H9=\"\"),\"\",Vorgaben!$H9)","v":"VorlageKlasse1b"},{"$f":"IF(OR($A21=\"\",Vorgaben!$I$7=\"\"),\"\",$E$2)","v":"self"},{"$f":"IF(OR($A21=\"\",Vorgaben!$I$7=\"\"),\"\",\"editingteacher\")","v":"editingteacher"},{"$f":"IF(OR($A21=\"\",Vorgaben!$I$7=\"\"),\"\",Vorgaben!$I$7)","v":"djv5456+"},{"$f":"IF(OR($A21=\"\",Vorgaben!$I$14=\"\"),\"\",\"self\")","v":""},{"$f":"IF(OR($A21=\"\",Vorgaben!$I$14=\"\"),\"\",\"student\")","v":""},{"$f":"IF(OR($A21=\"\",Vorgaben!$I$14=\"\"),\"\",Vorgaben!$I$14)","v":""}]
[{"$f":"IF(OR(Vorgaben!$F$8=\"\",Vorgaben!$G10=\"\"),\"\",IF(Vorgaben!$B$6=\"\",Vorgaben!$F$8&Vorgaben!$G10,Vorgaben!$B$6&\" \"&Vorgaben!$F$8&Vorgaben!$G10))","v":""},"","",{"$f":"IF(OR($A22=\"\",Vorgaben!$H10=\"\"),\"\",Vorgaben!$H10)","v":""},{"$f":"IF(OR($A22=\"\",Vorgaben!$I$7=\"\"),\"\",$E$2)","v":""},{"$f":"IF(OR($A22=\"\",Vorgaben!$I$7=\"\"),\"\",\"editingteacher\")","v":""},{"$f":"IF(OR($A22=\"\",Vorgaben!$I$7=\"\"),\"\",Vorgaben!$I$7)","v":""},{"$f":"IF(OR($A22=\"\",Vorgaben!$I$14=\"\"),\"\",\"self\")","v":""},{"$f":"IF(OR($A22=\"\",Vorgaben!$I$14=\"\"),\"\",\"student\")","v":""},{"$f":"IF(OR($A22=\"\",Vorgaben!$I$14=\"\"),\"\",Vorgaben!$I$14)","v":""}]
[{"$f":"IF(OR(Vorgaben!$F$8=\"\",Vorgaben!$G11=\"\"),\"\",IF(Vorgaben!$B$6=\"\",Vorgaben!$F$8&Vorgaben!$G11,Vorgaben!$B$6&\" \"&Vorgaben!$F$8&Vorgaben!$G11))","v":""},"","",{"$f":"IF(OR($A23=\"\",Vorgaben!$H11=\"\"),\"\",Vorgaben!$H11)","v":""},{"$f":"IF(OR($A23=\"\",Vorgaben!$I$7=\"\"),\"\",$E$2)","v":""},{"$f":"IF(OR($A23=\"\",Vorgaben!$I$7=\"\"),\"\",\"editingteacher\")","v":""},{"$f":"IF(OR($A23=\"\",Vorgaben!$I$7=\"\"),\"\",Vorgaben!$I$7)","v":""},{"$f":"IF(OR($A23=\"\",Vorgaben!$I$14=\"\"),\"\",\"self\")","v":""},{"$f":"IF(OR($A23=\"\",Vorgaben!$I$14=\"\"),\"\",\"student\")","v":""},{"$f":"IF(OR($A23=\"\",Vorgaben!$I$14=\"\"),\"\",Vorgaben!$I$14)","v":""}]
[{"$f":"IF(OR(Vorgaben!$F$8=\"\",Vorgaben!$G12=\"\"),\"\",IF(Vorgaben!$B$6=\"\",Vorgaben!$F$8&Vorgaben!$G12,Vorgaben!$B$6&\" \"&Vorgaben!$F$8&Vorgaben!$G12))","v":""},"","",{"$f":"IF(OR($A24=\"\",Vorgaben!$H12=\"\"),\"\",Vorgaben!$H12)","v":""},{"$f":"IF(OR($A24=\"\",Vorgaben!$I$7=\"\"),\"\",$E$2)","v":""},{"$f":"IF(OR($A24=\"\",Vorgaben!$I$7=\"\"),\"\",\"editingteacher\")","v":""},{"$f":"IF(OR($A24=\"\",Vorgaben!$I$7=\"\"),\"\",Vorgaben!$I$7)","v":""},{"$f":"IF(OR($A24=\"\",Vorgaben!$I$14=\"\"),\"\",\"self\")","v":""},{"$f":"IF(OR($A24=\"\",Vorgaben!$I$14=\"\"),\"\",\"student\")","v":""},{"$f":"IF(OR($A24=\"\",Vorgaben!$I$14=\"\"),\"\",Vorgaben!$I$14)","v":""}]

{"sheet":"Diffkurse","index":2,"n_rows":31,"n_cols":10,"rows_kept":31,"cut":false,"hidden":false,"merged":[]}
["shortname","fullname","category_path","templatecourse","enrolment_1","enrolment_1_role","enrolment_1_password","enrolement_2","enrolement_2_role","enrolement_2_passwort"]
[{"$f":"IF(Vorgaben!$K6=\"\",\"\",IF(Vorgaben!$B$6=\"\",Vorgaben!$B$6&Vorgaben!L6&Vorgaben!$B$9,Vorgaben!$B$6&\" \"&Vorgaben!L6&Vorgaben!$B$9))","v":"Diffkurs "},{"$f":"A2","v":"Diffkurs "},{"$f":"IF(A2=\"\",\"\",IF(Vorgaben!$B$3=\"\",\"\",Vorgaben!$B$3&\" / \")&IF(Vorgaben!$D$3=\"\",\"\",Vorgaben!$D$3&\" / \")&IF(Vorgaben!$F$3=\"\",\"\",Vorgaben!$F$3&\" / \")&IF(Vorgaben!$H$3=\"\",\"\",Vorgaben!$H$3&\" /\")&IF(Vorgaben!$B$6=\"\",Vorgaben!D6,Vorgaben!D6&\" (\"&Vorgaben!$B$6&\")\"))","v":"Unterricht / 2020-21 / Stufe 05"},{"$f":"IF(OR($A2=\"\",Vorgaben!$M6=\"\"),\"\",Vorgaben!$M6)","v":"VorlageDiff1b"},{"$f":"IF(OR($A2=\"\",Vorgaben!$N$7=\"\"),\"\",\"self\")","v":"self"},{"$f":"IF(OR($A2=\"\",Vorgaben!$N$7=\"\"),\"\",\"editingteacher\")","v":"editingteacher"},{"$f":"IF(OR($A2=\"\",Vorgaben!$N$7=\"\"),\"\",Vorgaben!$N$7)","v":"djv5456+"},{"$f":"IF(OR($A2=\"\",Vorgaben!$O$6=\"\"),\"\",\"self\")","v":"self"},{"$f":"IF(OR($A2=\"\",Vorgaben!$O$6=\"\"),\"\",\"student\")","v":"student"},{"$f":"IF(OR($A2=\"\",Vorgaben!$O6=\"\"),\"\",Vorgaben!$O6)","v":"diff#05"}]
[{"$f":"IF(Vorgaben!$K7=\"\",\"\",IF(Vorgaben!$B$6=\"\",Vorgaben!$B$6&Vorgaben!L7&Vorgaben!$B$9,Vorgaben!$B$6&\" \"&Vorgaben!L7&Vorgaben!$B$9))","v":""},{"$f":"A3","v":""},{"$f":"IF(A3=\"\",\"\",IF(Vorgaben!$B$3=\"\",\"\",Vorgaben!$B$3&\" / \")&IF(Vorgaben!$D$3=\"\",\"\",Vorgaben!$D$3&\" / \")&IF(Vorgaben!$F$3=\"\",\"\",Vorgaben!$F$3&\" / \")&IF(Vorgaben!$H$3=\"\",\"\",Vorgaben!$H$3&\" /\")&IF(Vorgaben!$B$6=\"\",Vorgaben!D7,Vorgaben!D7&\" (\"&Vorgaben!$B$6&\")\"))","v":""},{"$f":"IF(OR($A3=\"\",Vorgaben!$M7=\"\"),\"\",Vorgaben!$M7)","v":""},{"$f":"IF(OR($A3=\"\",Vorgaben!$N$7=\"\"),\"\",\"self\")","v":""},{"$f":"IF(OR($A3=\"\",Vorgaben!$N$7=\"\"),\"\",\"editingteacher\")","v":""},{"$f":"IF(OR($A3=\"\",Vorgaben!$N$7=\"\"),\"\",Vorgaben!$N$7)","v":""},{"$f":"IF(OR($A3=\"\",Vorgaben!$O7=\"\"),\"\",\"self\")","v":""},{"$f":"IF(OR($A3=\"\",Vorgaben!$O7=\"\"),\"\",\"student\")","v":""},{"$f":"IF(OR($A3=\"\",Vorgaben!$O7=\"\"),\"\",Vorgaben!$O7)","v":""}]
[{"$f":"IF(Vorgaben!$K8=\"\",\"\",IF(Vorgaben!$B$6=\"\",Vorgaben!$B$6&Vorgaben!L8&Vorgaben!$B$9,Vorgaben!$B$6&\" \"&Vorgaben!L8&Vorgaben!$B$9))","v":""},"",{"$f":"IF(A4=\"\",\"\",IF(Vorgaben!$B$3=\"\",\"\",Vorgaben!$B$3&\" / \")&IF(Vorgaben!$D$3=\"\",\"\",Vorgaben!$D$3&\" / \")&IF(Vorgaben!$F$3=\"\",\"\",Vorgaben!$F$3&\" / \")&IF(Vorgaben!$H$3=\"\",\"\",Vorgaben!$H$3&\" /\")&IF(Vorgaben!$B$6=\"\",Vorgaben!D8,Vorgaben!D8&\" (\"&Vorgaben!$B$6&\")\"))","v":""},{"$f":"IF(OR($A4=\"\",Vorgaben!$M8=\"\"),\"\",Vorgaben!$M8)","v":""},{"$f":"IF(OR($A4=\"\",Vorgaben!$N$7=\"\"),\"\",\"self\")","v":""},{"$f":"IF(OR($A4=\"\",Vorgaben!$N$7=\"\"),\"\",\"editingteacher\")","v":""},{"$f":"IF(OR($A4=\"\",Vorgaben!$N$7=\"\"),\"\",Vorgaben!$N$7)","v":""},{"$f":"IF(OR($A4=\"\",Vorgaben!$O8=\"\"),\"\",\"self\")","v":""},{"$f":"IF(OR($A4=\"\",Vorgaben!$O8=\"\"),\"\",\"student\")","v":""},{"$f":"IF(OR($A4=\"\",Vorgaben!$O8=\"\"),\"\",Vorgaben!$O8)","v":""}]
[{"$f":"IF(Vorgaben!$K9=\"\",\"\",IF(Vorgaben!$B$6=\"\",Vorgaben!$B$6&Vorgaben!L9&Vorgaben!$B$9,Vorgaben!$B$6&\" \"&Vorgaben!L9&Vorgaben!$B$9))","v":""},"",{"$f":"IF(A5=\"\",\"\",IF(Vorgaben!$B$3=\"\",\"\",Vorgaben!$B$3&\" / \")&IF(Vorgaben!$D$3=\"\",\"\",Vorgaben!$D$3&\" / \")&IF(Vorgaben!$F$3=\"\",\"\",Vorgaben!$F$3&\" / \")&IF(Vorgaben!$H$3=\"\",\"\",Vorgaben!$H$3&\" /\")&IF(Vorgaben!$B$6=\"\",Vorgaben!D9,Vorgaben!D9&\" (\"&Vorgaben!$B$6&\")\"))","v":""},{"$f":"IF(OR($A5=\"\",Vorgaben!$M9=\"\"),\"\",Vorgaben!$M9)","v":""},{"$f":"IF(OR($A5=\"\",Vorgaben!$N$7=\"\"),\"\",\"self\")","v":""},{"$f":"IF(OR($A5=\"\",Vorgaben!$N$7=\"\"),\"\",\"editingteacher\")","v":""},{"$f":"IF(OR($A5=\"\",Vorgaben!$N$7=\"\"),\"\",Vorgaben!$N$7)","v":""},{"$f":"IF(OR($A5=\"\",Vorgaben!$O9=\"\"),\"\",\"self\")","v":""},{"$f":"IF(OR($A5=\"\",Vorgaben!$O9=\"\"),\"\",\"student\")","v":""},{"$f":"IF(OR($A5=\"\",Vorgaben!$O9=\"\"),\"\",Vorgaben!$O9)","v":""}]
[{"$f":"IF(Vorgaben!$K10=\"\",\"\",IF(Vorgaben!$B$6=\"\",Vorgaben!$B$6&Vorgaben!L10&Vorgaben!$B$9,Vorgaben!$B$6&\" \"&Vorgaben!L10&Vorgaben!$B$9))","v":""},"",{"$f":"IF(A6=\"\",\"\",IF(Vorgaben!$B$3=\"\",\"\",Vorgaben!$B$3&\" / \")&IF(Vorgaben!$D$3=\"\",\"\",Vorgaben!$D$3&\" / \")&IF(Vorgaben!$F$3=\"\",\"\",Vorgaben!$F$3&\" / \")&IF(Vorgaben!$H$3=\"\",\"\",Vorgaben!$H$3&\" /\")&IF(Vorgaben!$B$6=\"\",Vorgaben!D10,Vorgaben!D10&\" (\"&Vorgaben!$B$6&\")\"))","v":""},{"$f":"IF(OR($A6=\"\",Vorgaben!$M10=\"\"),\"\",Vorgaben!$M10)","v":""},{"$f":"IF(OR($A6=\"\",Vorgaben!$N$7=\"\"),\"\",\"self\")","v":""},{"$f":"IF(OR($A6=\"\",Vorgaben!$N$7=\"\"),\"\",\"editingteacher\")","v":""},{"$f":"IF(OR($A6=\"\",Vorgaben!$N$7=\"\"),\"\",Vorgaben!$N$7)","v":""},{"$f":"IF(OR($A6=\"\",Vorgaben!$O10=\"\"),\"\",\"self\")","v":""},{"$f":"IF(OR($A6=\"\",Vorgaben!$O10=\"\"),\"\",\"student\")","v":""},{"$f":"IF(OR($A6=\"\",Vorgaben!$O10=\"\"),\"\",Vorgaben!$O10)","v":""}]
[{"$f":"IF(Vorgaben!$K11=\"\",\"\",IF(Vorgaben!$B$6=\"\",Vorgaben!$B$6&Vorgaben!L11&Vorgaben!$B$9,Vorgaben!$B$6&\" \"&Vorgaben!L11&Vorgaben!$B$9))","v":""},"",{"$f":"IF(A7=\"\",\"\",IF(Vorgaben!$B$3=\"\",\"\",Vorgaben!$B$3&\" / \")&IF(Vorgaben!$D$3=\"\",\"\",Vorgaben!$D$3&\" / \")&IF(Vorgaben!$F$3=\"\",\"\",Vorgaben!$F$3&\" / \")&IF(Vorgaben!$H$3=\"\",\"\",Vorgaben!$H$3&\" /\")&IF(Vorgaben!$B$6=\"\",Vorgaben!D11,Vorgaben!D11&\" (\"&Vorgaben!$B$6&\")\"))","v":""},{"$f":"IF(OR($A7=\"\",Vorgaben!$M11=\"\"),\"\",Vorgaben!$M11)","v":""},{"$f":"IF(OR($A7=\"\",Vorgaben!$N$7=\"\"),\"\",\"self\")","v":""},{"$f":"IF(OR($A7=\"\",Vorgaben!$N$7=\"\"),\"\",\"editingteacher\")","v":""},{"$f":"IF(OR($A7=\"\",Vorgaben!$N$7=\"\"),\"\",Vorgaben!$N$7)","v":""},{"$f":"IF(OR($A7=\"\",Vorgaben!$O11=\"\"),\"\",\"self\")","v":""},{"$f":"IF(OR($A7=\"\",Vorgaben!$O11=\"\"),\"\",\"student\")","v":""},{"$f":"IF(OR($A7=\"\",Vorgaben!$O11=\"\"),\"\",Vorgaben!$O11)","v":""}]
[{"$f":"IF(Vorgaben!$K12=\"\",\"\",IF(Vorgaben!$B$6=\"\",Vorgaben!$B$6&Vorgaben!L12&Vorgaben!$B$9,Vorgaben!$B$6&\" \"&Vorgaben!L12&Vorgaben!$B$9))","v":""},"",{"$f":"IF(A8=\"\",\"\",IF(Vorgaben!$B$3=\"\",\"\",Vorgaben!$B$3&\" / \")&IF(Vorgaben!$D$3=\"\",\"\",Vorgaben!$D$3&\" / \")&IF(Vorgaben!$F$3=\"\",\"\",Vorgaben!$F$3&\" / \")&IF(Vorgaben!$H$3=\"\",\"\",Vorgaben!$H$3&\" /\")&IF(Vorgaben!$B$6=\"\",Vorgaben!D12,Vorgaben!D12&\" (\"&Vorgaben!$B$6&\")\"))","v":""},{"$f":"IF(OR($A8=\"\",Vorgaben!$M12=\"\"),\"\",Vorgaben!$M12)","v":""},{"$f":"IF(OR($A8=\"\",Vorgaben!$N$7=\"\"),\"\",\"self\")","v":""},{"$f":"IF(OR($A8=\"\",Vorgaben!$N$7=\"\"),\"\",\"editingteacher\")","v":""},{"$f":"IF(OR($A8=\"\",Vorgaben!$N$7=\"\"),\"\",Vorgaben!$N$7)","v":""},{"$f":"IF(OR($A8=\"\",Vorgaben!$O12=\"\"),\"\",\"self\")","v":""},{"$f":"IF(OR($A8=\"\",Vorgaben!$O12=\"\"),\"\",\"student\")","v":""},{"$f":"IF(OR($A8=\"\",Vorgaben!$O12=\"\"),\"\",Vorgaben!$O12)","v":""}]
[{"$f":"IF(Vorgaben!$K13=\"\",\"\",IF(Vorgaben!$B$6=\"\",Vorgaben!$B$6&Vorgaben!L13&Vorgaben!$B$9,Vorgaben!$B$6&\" \"&Vorgaben!L13&Vorgaben!$B$9))","v":""},"",{"$f":"IF(A9=\"\",\"\",IF(Vorgaben!$B$3=\"\",\"\",Vorgaben!$B$3&\" / \")&IF(Vorgaben!$D$3=\"\",\"\",Vorgaben!$D$3&\" / \")&IF(Vorgaben!$F$3=\"\",\"\",Vorgaben!$F$3&\" / \")&IF(Vorgaben!$H$3=\"\",\"\",Vorgaben!$H$3&\" /\")&IF(Vorgaben!$B$6=\"\",Vorgaben!D13,Vorgaben!D13&\" (\"&Vorgaben!$B$6&\")\"))","v":""},{"$f":"IF(OR($A9=\"\",Vorgaben!$M13=\"\"),\"\",Vorgaben!$M13)","v":""},{"$f":"IF(OR($A9=\"\",Vorgaben!$N$7=\"\"),\"\",\"self\")","v":""},{"$f":"IF(OR($A9=\"\",Vorgaben!$N$7=\"\"),\"\",\"editingteacher\")","v":""},{"$f":"IF(OR($A9=\"\",Vorgaben!$N$7=\"\"),\"\",Vorgaben!$N$7)","v":""},{"$f":"IF(OR($A9=\"\",Vorgaben!$O13=\"\"),\"\",\"self\")","v":""},{"$f":"IF(OR($A9=\"\",Vorgaben!$O13=\"\"),\"\",\"student\")","v":""},{"$f":"IF(OR($A9=\"\",Vorgaben!$O13=\"\"),\"\",Vorgaben!$O13)","v":""}]
[{"$f":"IF(Vorgaben!$K14=\"\",\"\",IF(Vorgaben!$B$6=\"\",Vorgaben!$B$6&Vorgaben!L14&Vorgaben!$B$9,Vorgaben!$B$6&\" \"&Vorgaben!L14&Vorgaben!$B$9))","v":""},"",{"$f":"IF(A10=\"\",\"\",IF(Vorgaben!$B$3=\"\",\"\",Vorgaben!$B$3&\" / \")&IF(Vorgaben!$D$3=\"\",\"\",Vorgaben!$D$3&\" / \")&IF(Vorgaben!$F$3=\"\",\"\",Vorgaben!$F$3&\" / \")&IF(Vorgaben!$H$3=\"\",\"\",Vorgaben!$H$3&\" /\")&IF(Vorgaben!$B$6=\"\",Vorgaben!D14,Vorgaben!D14&\" (\"&Vorgaben!$B$6&\")\"))","v":""},{"$f":"IF(OR($A10=\"\",Vorgaben!$M14=\"\"),\"\",Vorgaben!$M14)","v":""},{"$f":"IF(OR($A10=\"\",Vorgaben!$N$7=\"\"),\"\",\"self\")","v":""},{"$f":"IF(OR($A10=\"\",Vorgaben!$N$7=\"\"),\"\",\"editingteacher\")","v":""},{"$f":"IF(OR($A10=\"\",Vorgaben!$N$7=\"\"),\"\",Vorgaben!$N$7)","v":""},{"$f":"IF(OR($A10=\"\",Vorgaben!$O14=\"\"),\"\",\"self\")","v":""},{"$f":"IF(OR($A10=\"\",Vorgaben!$O14=\"\"),\"\",\"student\")","v":""},{"$f":"IF(OR($A10=\"\",Vorgaben!$O14=\"\"),\"\",Vorgaben!$O14)","v":""}]
[{"$f":"IF(Vorgaben!$K15=\"\",\"\",IF(Vorgaben!$B$6=\"\",Vorgaben!$B$6&Vorgaben!L15&Vorgaben!$B$9,Vorgaben!$B$6&\" \"&Vorgaben!L15&Vorgaben!$B$9))","v":""},"",{"$f":"IF(A11=\"\",\"\",IF(Vorgaben!$B$3=\"\",\"\",Vorgaben!$B$3&\" / \")&IF(Vorgaben!$D$3=\"\",\"\",Vorgaben!$D$3&\" / \")&IF(Vorgaben!$F$3=\"\",\"\",Vorgaben!$F$3&\" / \")&IF(Vorgaben!$H$3=\"\",\"\",Vorgaben!$H$3&\" /\")&IF(Vorgaben!$B$6=\"\",Vorgaben!D15,Vorgaben!D15&\" (\"&Vorgaben!$B$6&\")\"))","v":""},{"$f":"IF(OR($A11=\"\",Vorgaben!$M15=\"\"),\"\",Vorgaben!$M15)","v":""},{"$f":"IF(OR($A11=\"\",Vorgaben!$N$7=\"\"),\"\",\"self\")","v":""},{"$f":"IF(OR($A11=\"\",Vorgaben!$N$7=\"\"),\"\",\"editingteacher\")","v":""},{"$f":"IF(OR($A11=\"\",Vorgaben!$N$7=\"\"),\"\",Vorgaben!$N$7)","v":""},{"$f":"IF(OR($A11=\"\",Vorgaben!$O15=\"\"),\"\",\"self\")","v":""},{"$f":"IF(OR($A11=\"\",Vorgaben!$O15=\"\"),\"\",\"student\")","v":""},{"$f":"IF(OR($A11=\"\",Vorgaben!$O15=\"\"),\"\",Vorgaben!$O15)","v":""}]
[{"$f":"IF(Vorgaben!$K16=\"\",\"\",IF(Vorgaben!$B$6=\"\",Vorgaben!$B$6&Vorgaben!L16&Vorgaben!$B$9,Vorgaben!$B$6&\" \"&Vorgaben!L16&Vorgaben!$B$9))","v":""},"",{"$f":"IF(A12=\"\",\"\",IF(Vorgaben!$B$3=\"\",\"\",Vorgaben!$B$3&\" / \")&IF(Vorgaben!$D$3=\"\",\"\",Vorgaben!$D$3&\" / \")&IF(Vorgaben!$F$3=\"\",\"\",Vorgaben!$F$3&\" / \")&IF(Vorgaben!$H$3=\"\",\"\",Vorgaben!$H$3&\" /\")&IF(Vorgaben!$B$6=\"\",Vorgaben!D16,Vorgaben!D16&\" (\"&Vorgaben!$B$6&\")\"))","v":""},{"$f":"IF(OR($A12=\"\",Vorgaben!$M16=\"\"),\"\",Vorgaben!$M16)","v":""},{"$f":"IF(OR($A12=\"\",Vorgaben!$N$7=\"\"),\"\",\"self\")","v":""},{"$f":"IF(OR($A12=\"\",Vorgaben!$N$7=\"\"),\"\",\"editingteacher\")","v":""},{"$f":"IF(OR($A12=\"\",Vorgaben!$N$7=\"\"),\"\",Vorgaben!$N$7)","v":""},{"$f":"IF(OR($A12=\"\",Vorgaben!$O16=\"\"),\"\",\"self\")","v":""},{"$f":"IF(OR($A12=\"\",Vorgaben!$O16=\"\"),\"\",\"student\")","v":""},{"$f":"IF(OR($A12=\"\",Vorgaben!$O16=\"\"),\"\",Vorgaben!$O16)","v":""}]
[{"$f":"IF(Vorgaben!$K17=\"\",\"\",IF(Vorgaben!$B$6=\"\",Vorgaben!$B$6&Vorgaben!L17&Vorgaben!$B$9,Vorgaben!$B$6&\" \"&Vorgaben!L17&Vorgaben!$B$9))","v":""},"",{"$f":"IF(A13=\"\",\"\",IF(Vorgaben!$B$3=\"\",\"\",Vorgaben!$B$3&\" / \")&IF(Vorgaben!$D$3=\"\",\"\",Vorgaben!$D$3&\" / \")&IF(Vorgaben!$F$3=\"\",\"\",Vorgaben!$F$3&\" / \")&IF(Vorgaben!$H$3=\"\",\"\",Vorgaben!$H$3&\" /\")&IF(Vorgaben!$B$6=\"\",Vorgaben!D17,Vorgaben!D17&\" (\"&Vorgaben!$B$6&\")\"))","v":""},{"$f":"IF(OR($A13=\"\",Vorgaben!$M17=\"\"),\"\",Vorgaben!$M17)","v":""},{"$f":"IF(OR($A13=\"\",Vorgaben!$N$7=\"\"),\"\",\"self\")","v":""},{"$f":"IF(OR($A13=\"\",Vorgaben!$N$7=\"\"),\"\",\"editingteacher\")","v":""},{"$f":"IF(OR($A13=\"\",Vorgaben!$N$7=\"\"),\"\",Vorgaben!$N$7)","v":""},{"$f":"IF(OR($A13=\"\",Vorgaben!$O17=\"\"),\"\",\"self\")","v":""},{"$f":"IF(OR($A13=\"\",Vorgaben!$O17=\"\"),\"\",\"student\")","v":""},{"$f":"IF(OR($A13=\"\",Vorgaben!$O17=\"\"),\"\",Vorgaben!$O17)","v":""}]
[{"$f":"IF(Vorgaben!$K18=\"\",\"\",IF(Vorgaben!$B$6=\"\",Vorgaben!$B$6&Vorgaben!L18&Vorgaben!$B$9,Vorgaben!$B$6&\" \"&Vorgaben!L18&Vorgaben!$B$9))","v":""},"",{"$f":"IF(A14=\"\",\"\",IF(Vorgaben!$B$3=\"\",\"\",Vorgaben!$B$3&\" / \")&IF(Vorgaben!$D$3=\"\",\"\",Vorgaben!$D$3&\" / \")&IF(Vorgaben!$F$3=\"\",\"\",Vorgaben!$F$3&\" / \")&IF(Vorgaben!$H$3=\"\",\"\",Vorgaben!$H$3&\" /\")&IF(Vorgaben!$B$6=\"\",Vorgaben!D18,Vorgaben!D18&\" (\"&Vorgaben!$B$6&\")\"))","v":""},{"$f":"IF(OR($A14=\"\",Vorgaben!$M18=\"\"),\"\",Vorgaben!$M18)","v":""},{"$f":"IF(OR($A14=\"\",Vorgaben!$N$7=\"\"),\"\",\"self\")","v":""},{"$f":"IF(OR($A14=\"\",Vorgaben!$N$7=\"\"),\"\",\"editingteacher\")","v":""},{"$f":"IF(OR($A14=\"\",Vorgaben!$N$7=\"\"),\"\",Vorgaben!$N$7)","v":""},{"$f":"IF(OR($A14=\"\",Vorgaben!$O18=\"\"),\"\",\"self\")","v":""},{"$f":"IF(OR($A14=\"\",Vorgaben!$O18=\"\"),\"\",\"student\")","v":""},{"$f":"IF(OR($A14=\"\",Vorgaben!$O18=\"\"),\"\",Vorgaben!$O18)","v":""}]
[{"$f":"IF(Vorgaben!$K19=\"\",\"\",IF(Vorgaben!$B$6=\"\",Vorgaben!$B$6&Vorgaben!L19&Vorgaben!$B$9,Vorgaben!$B$6&\" \"&Vorgaben!L19&Vorgaben!$B$9))","v":""},"",{"$f":"IF(A15=\"\",\"\",IF(Vorgaben!$B$3=\"\",\"\",Vorgaben!$B$3&\" / \")&IF(Vorgaben!$D$3=\"\",\"\",Vorgaben!$D$3&\" / \")&IF(Vorgaben!$F$3=\"\",\"\",Vorgaben!$F$3&\" / \")&IF(Vorgaben!$H$3=\"\",\"\",Vorgaben!$H$3&\" /\")&IF(Vorgaben!$B$6=\"\",Vorgaben!D19,Vorgaben!D19&\" (\"&Vorgaben!$B$6&\")\"))","v":""},{"$f":"IF(OR($A15=\"\",Vorgaben!$M19=\"\"),\"\",Vorgaben!$M19)","v":""},{"$f":"IF(OR($A15=\"\",Vorgaben!$N$7=\"\"),\"\",\"self\")","v":""},{"$f":"IF(OR($A15=\"\",Vorgaben!$N$7=\"\"),\"\",\"editingteacher\")","v":""},{"$f":"IF(OR($A15=\"\",Vorgaben!$N$7=\"\"),\"\",Vorgaben!$N$7)","v":""},{"$f":"IF(OR($A15=\"\",Vorgaben!$O19=\"\"),\"\",\"self\")","v":""},{"$f":"IF(OR($A15=\"\",Vorgaben!$O19=\"\"),\"\",\"student\")","v":""},{"$f":"IF(OR($A15=\"\",Vorgaben!$O19=\"\"),\"\",Vorgaben!$O19)","v":""}]
[{"$f":"IF(Vorgaben!$K20=\"\",\"\",IF(Vorgaben!$B$6=\"\",Vorgaben!$B$6&Vorgaben!L20&Vorgaben!$B$9,Vorgaben!$B$6&\" \"&Vorgaben!L20&Vorgaben!$B$9))","v":""},"",{"$f":"IF(A16=\"\",\"\",IF(Vorgaben!$B$3=\"\",\"\",Vorgaben!$B$3&\" / \")&IF(Vorgaben!$D$3=\"\",\"\",Vorgaben!$D$3&\" / \")&IF(Vorgaben!$F$3=\"\",\"\",Vorgaben!$F$3&\" / \")&IF(Vorgaben!$H$3=\"\",\"\",Vorgaben!$H$3&\" /\")&IF(Vorgaben!$B$6=\"\",Vorgaben!D20,Vorgaben!D20&\" (\"&Vorgaben!$B$6&\")\"))","v":""},{"$f":"IF(OR($A16=\"\",Vorgaben!$M20=\"\"),\"\",Vorgaben!$M20)","v":""},{"$f":"IF(OR($A16=\"\",Vorgaben!$N$7=\"\"),\"\",\"self\")","v":""},{"$f":"IF(OR($A16=\"\",Vorgaben!$N$7=\"\"),\"\",\"editingteacher\")","v":""},{"$f":"IF(OR($A16=\"\",Vorgaben!$N$7=\"\"),\"\",Vorgaben!$N$7)","v":""},{"$f":"IF(OR($A16=\"\",Vorgaben!$O20=\"\"),\"\",\"self\")","v":""},{"$f":"IF(OR($A16=\"\",Vorgaben!$O20=\"\"),\"\",\"student\")","v":""},{"$f":"IF(OR($A16=\"\",Vorgaben!$O20=\"\"),\"\",Vorgaben!$O20)","v":""}]
[{"$f":"IF(Vorgaben!$K21=\"\",\"\",IF(Vorgaben!$B$6=\"\",Vorgaben!$B$6&Vorgaben!L21&Vorgaben!$B$9,Vorgaben!$B$6&\" \"&Vorgaben!L21&Vorgaben!$B$9))","v":""},"",{"$f":"IF(A17=\"\",\"\",IF(Vorgaben!$B$3=\"\",\"\",Vorgaben!$B$3&\" / \")&IF(Vorgaben!$D$3=\"\",\"\",Vorgaben!$D$3&\" / \")&IF(Vorgaben!$F$3=\"\",\"\",Vorgaben!$F$3&\" / \")&IF(Vorgaben!$H$3=\"\",\"\",Vorgaben!$H$3&\" /\")&IF(Vorgaben!$B$6=\"\",Vorgaben!D21,Vorgaben!D21&\" (\"&Vorgaben!$B$6&\")\"))","v":""},{"$f":"IF(OR($A17=\"\",Vorgaben!$M21=\"\"),\"\",Vorgaben!$M21)","v":""},{"$f":"IF(OR($A17=\"\",Vorgaben!$N$7=\"\"),\"\",\"self\")","v":""},{"$f":"IF(OR($A17=\"\",Vorgaben!$N$7=\"\"),\"\",\"editingteacher\")","v":""},{"$f":"IF(OR($A17=\"\",Vorgaben!$N$7=\"\"),\"\",Vorgaben!$N$7)","v":""},{"$f":"IF(OR($A17=\"\",Vorgaben!$O21=\"\"),\"\",\"self\")","v":""},{"$f":"IF(OR($A17=\"\",Vorgaben!$O21=\"\"),\"\",\"student\")","v":""},{"$f":"IF(OR($A17=\"\",Vorgaben!$O21=\"\"),\"\",Vorgaben!$O21)","v":""}]
[{"$f":"IF(Vorgaben!$K22=\"\",\"\",IF(Vorgaben!$B$6=\"\",Vorgaben!$B$6&Vorgaben!L22&Vorgaben!$B$9,Vorgaben!$B$6&\" \"&Vorgaben!L22&Vorgaben!$B$9))","v":""},"",{"$f":"IF(A18=\"\",\"\",IF(Vorgaben!$B$3=\"\",\"\",Vorgaben!$B$3&\" / \")&IF(Vorgaben!$D$3=\"\",\"\",Vorgaben!$D$3&\" / \")&IF(Vorgaben!$F$3=\"\",\"\",Vorgaben!$F$3&\" / \")&IF(Vorgaben!$H$3=\"\",\"\",Vorgaben!$H$3&\" /\")&IF(Vorgaben!$B$6=\"\",Vorgaben!D22,Vorgaben!D22&\" (\"&Vorgaben!$B$6&\")\"))","v":""},{"$f":"IF(OR($A18=\"\",Vorgaben!$M22=\"\"),\"\",Vorgaben!$M22)","v":""},{"$f":"IF(OR($A18=\"\",Vorgaben!$N$7=\"\"),\"\",\"self\")","v":""},{"$f":"IF(OR($A18=\"\",Vorgaben!$N$7=\"\"),\"\",\"editingteacher\")","v":""},{"$f":"IF(OR($A18=\"\",Vorgaben!$N$7=\"\"),\"\",Vorgaben!$N$7)","v":""},{"$f":"IF(OR($A18=\"\",Vorgaben!$O22=\"\"),\"\",\"self\")","v":""},{"$f":"IF(OR($A18=\"\",Vorgaben!$O22=\"\"),\"\",\"student\")","v":""},{"$f":"IF(OR($A18=\"\",Vorgaben!$O22=\"\"),\"\",Vorgaben!$O22)","v":""}]
[{"$f":"IF(Vorgaben!$K23=\"\",\"\",IF(Vorgaben!$B$6=\"\",Vorgaben!$B$6&Vorgaben!L23&Vorgaben!$B$9,Vorgaben!$B$6&\" \"&Vorgaben!L23&Vorgaben!$B$9))","v":""},"",{"$f":"IF(A19=\"\",\"\",IF(Vorgaben!$B$3=\"\",\"\",Vorgaben!$B$3&\" / \")&IF(Vorgaben!$D$3=\"\",\"\",Vorgaben!$D$3&\" / \")&IF(Vorgaben!$F$3=\"\",\"\",Vorgaben!$F$3&\" / \")&IF(Vorgaben!$H$3=\"\",\"\",Vorgaben!$H$3&\" /\")&IF(Vorgaben!$B$6=\"\",Vorgaben!D23,Vorgaben!D23&\" (\"&Vorgaben!$B$6&\")\"))","v":""},{"$f":"IF(OR($A19=\"\",Vorgaben!$M23=\"\"),\"\",Vorgaben!$M23)","v":""},{"$f":"IF(OR($A19=\"\",Vorgaben!$N$7=\"\"),\"\",\"self\")","v":""},{"$f":"IF(OR($A19=\"\",Vorgaben!$N$7=\"\"),\"\",\"editingteacher\")","v":""},{"$f":"IF(OR($A19=\"\",Vorgaben!$N$7=\"\"),\"\",Vorgaben!$N$7)","v":""},{"$f":"IF(OR($A19=\"\",Vorgaben!$O23=\"\"),\"\",\"self\")","v":""},{"$f":"IF(OR($A19=\"\",Vorgaben!$O23=\"\"),\"\",\"student\")","v":""},{"$f":"IF(OR($A19=\"\",Vorgaben!$O23=\"\"),\"\",Vorgaben!$O23)","v":""}]
[{"$f":"IF(Vorgaben!$K24=\"\",\"\",IF(Vorgaben!$B$6=\"\",Vorgaben!$B$6&Vorgaben!L24&Vorgaben!$B$9,Vorgaben!$B$6&\" \"&Vorgaben!L24&Vorgaben!$B$9))","v":""},"",{"$f":"IF(A20=\"\",\"\",IF(Vorgaben!$B$3=\"\",\"\",Vorgaben!$B$3&\" / \")&IF(Vorgaben!$D$3=\"\",\"\",Vorgaben!$D$3&\" / \")&IF(Vorgaben!$F$3=\"\",\"\",Vorgaben!$F$3&\" / \")&IF(Vorgaben!$H$3=\"\",\"\",Vorgaben!$H$3&\" /\")&IF(Vorgaben!$B$6=\"\",Vorgaben!D24,Vorgaben!D24&\" (\"&Vorgaben!$B$6&\")\"))","v":""},{"$f":"IF(OR($A20=\"\",Vorgaben!$M24=\"\"),\"\",Vorgaben!$M24)","v":""},{"$f":"IF(OR($A20=\"\",Vorgaben!$N$7=\"\"),\"\",\"self\")","v":""},{"$f":"IF(OR($A20=\"\",Vorgaben!$N$7=\"\"),\"\",\"editingteacher\")","v":""},{"$f":"IF(OR($A20=\"\",Vorgaben!$N$7=\"\"),\"\",Vorgaben!$N$7)","v":""},{"$f":"IF(OR($A20=\"\",Vorgaben!$O24=\"\"),\"\",\"self\")","v":""},{"$f":"IF(OR($A20=\"\",Vorgaben!$O24=\"\"),\"\",\"student\")","v":""},{"$f":"IF(OR($A20=\"\",Vorgaben!$O24=\"\"),\"\",Vorgaben!$O24)","v":""}]
[{"$f":"IF(Vorgaben!$K25=\"\",\"\",IF(Vorgaben!$B$6=\"\",Vorgaben!$B$6&Vorgaben!L25&Vorgaben!$B$9,Vorgaben!$B$6&\" \"&Vorgaben!L25&Vorgaben!$B$9))","v":""},"",{"$f":"IF(A21=\"\",\"\",IF(Vorgaben!$B$3=\"\",\"\",Vorgaben!$B$3&\" / \")&IF(Vorgaben!$D$3=\"\",\"\",Vorgaben!$D$3&\" / \")&IF(Vorgaben!$F$3=\"\",\"\",Vorgaben!$F$3&\" / \")&IF(Vorgaben!$H$3=\"\",\"\",Vorgaben!$H$3&\" /\")&IF(Vorgaben!$B$6=\"\",Vorgaben!D25,Vorgaben!D25&\" (\"&Vorgaben!$B$6&\")\"))","v":""},{"$f":"IF(OR($A21=\"\",Vorgaben!$M25=\"\"),\"\",Vorgaben!$M25)","v":""},{"$f":"IF(OR($A21=\"\",Vorgaben!$N$7=\"\"),\"\",\"self\")","v":""},{"$f":"IF(OR($A21=\"\",Vorgaben!$N$7=\"\"),\"\",\"editingteacher\")","v":""},{"$f":"IF(OR($A21=\"\",Vorgaben!$N$7=\"\"),\"\",Vorgaben!$N$7)","v":""},{"$f":"IF(OR($A21=\"\",Vorgaben!$O25=\"\"),\"\",\"self\")","v":""},{"$f":"IF(OR($A21=\"\",Vorgaben!$O25=\"\"),\"\",\"student\")","v":""},{"$f":"IF(OR($A21=\"\",Vorgaben!$O25=\"\"),\"\",Vorgaben!$O25)","v":""}]
[{"$f":"IF(Vorgaben!$K26=\"\",\"\",IF(Vorgaben!$B$6=\"\",Vorgaben!$B$6&Vorgaben!L26&Vorgaben!$B$9,Vorgaben!$B$6&\" \"&Vorgaben!L26&Vorgaben!$B$9))","v":""},"",{"$f":"IF(A22=\"\",\"\",IF(Vorgaben!$B$3=\"\",\"\",Vorgaben!$B$3&\" / \")&IF(Vorgaben!$D$3=\"\",\"\",Vorgaben!$D$3&\" / \")&IF(Vorgaben!$F$3=\"\",\"\",Vorgaben!$F$3&\" / \")&IF(Vorgaben!$H$3=\"\",\"\",Vorgaben!$H$3&\" /\")&IF(Vorgaben!$B$6=\"\",Vorgaben!D26,Vorgaben!D26&\" (\"&Vorgaben!$B$6&\")\"))","v":""},{"$f":"IF(OR($A22=\"\",Vorgaben!$M26=\"\"),\"\",Vorgaben!$M26)","v":""},{"$f":"IF(OR($A22=\"\",Vorgaben!$N$7=\"\"),\"\",\"self\")","v":""},{"$f":"IF(OR($A22=\"\",Vorgaben!$N$7=\"\"),\"\",\"editingteacher\")","v":""},{"$f":"IF(OR($A22=\"\",Vorgaben!$N$7=\"\"),\"\",Vorgaben!$N$7)","v":""},{"$f":"IF(OR($A22=\"\",Vorgaben!$O26=\"\"),\"\",\"self\")","v":""},{"$f":"IF(OR($A22=\"\",Vorgaben!$O26=\"\"),\"\",\"student\")","v":""},{"$f":"IF(OR($A22=\"\",Vorgaben!$O26=\"\"),\"\",Vorgaben!$O26)","v":""}]
[{"$f":"IF(Vorgaben!$K27=\"\",\"\",IF(Vorgaben!$B$6=\"\",Vorgaben!$B$6&Vorgaben!L27&Vorgaben!$B$9,Vorgaben!$B$6&\" \"&Vorgaben!L27&Vorgaben!$B$9))","v":""},"",{"$f":"IF(A23=\"\",\"\",IF(Vorgaben!$B$3=\"\",\"\",Vorgaben!$B$3&\" / \")&IF(Vorgaben!$D$3=\"\",\"\",Vorgaben!$D$3&\" / \")&IF(Vorgaben!$F$3=\"\",\"\",Vorgaben!$F$3&\" / \")&IF(Vorgaben!$H$3=\"\",\"\",Vorgaben!$H$3&\" /\")&IF(Vorgaben!$B$6=\"\",Vorgaben!D27,Vorgaben!D27&\" (\"&Vorgaben!$B$6&\")\"))","v":""},{"$f":"IF(OR($A23=\"\",Vorgaben!$M27=\"\"),\"\",Vorgaben!$M27)","v":""},{"$f":"IF(OR($A23=\"\",Vorgaben!$N$7=\"\"),\"\",\"self\")","v":""},{"$f":"IF(OR($A23=\"\",Vorgaben!$N$7=\"\"),\"\",\"editingteacher\")","v":""},{"$f":"IF(OR($A23=\"\",Vorgaben!$N$7=\"\"),\"\",Vorgaben!$N$7)","v":""},{"$f":"IF(OR($A23=\"\",Vorgaben!$O27=\"\"),\"\",\"self\")","v":""},{"$f":"IF(OR($A23=\"\",Vorgaben!$O27=\"\"),\"\",\"student\")","v":""},{"$f":"IF(OR($A23=\"\",Vorgaben!$O27=\"\"),\"\",Vorgaben!$O27)","v":""}]
[{"$f":"IF(Vorgaben!$K28=\"\",\"\",IF(Vorgaben!$B$6=\"\",Vorgaben!$B$6&Vorgaben!L28&Vorgaben!$B$9,Vorgaben!$B$6&\" \"&Vorgaben!L28&Vorgaben!$B$9))","v":""},"",{"$f":"IF(A24=\"\",\"\",IF(Vorgaben!$B$3=\"\",\"\",Vorgaben!$B$3&\" / \")&IF(Vorgaben!$D$3=\"\",\"\",Vorgaben!$D$3&\" / \")&IF(Vorgaben!$F$3=\"\",\"\",Vorgaben!$F$3&\" / \")&IF(Vorgaben!$H$3=\"\",\"\",Vorgaben!$H$3&\" /\")&IF(Vorgaben!$B$6=\"\",Vorgaben!D28,Vorgaben!D28&\" (\"&Vorgaben!$B$6&\")\"))","v":""},{"$f":"IF(OR($A24=\"\",Vorgaben!$M28=\"\"),\"\",Vorgaben!$M28)","v":""},{"$f":"IF(OR($A24=\"\",Vorgaben!$N$7=\"\"),\"\",\"self\")","v":""},{"$f":"IF(OR($A24=\"\",Vorgaben!$N$7=\"\"),\"\",\"editingteacher\")","v":""},{"$f":"IF(OR($A24=\"\",Vorgaben!$N$7=\"\"),\"\",Vorgaben!$N$7)","v":""},{"$f":"IF(OR($A24=\"\",Vorgaben!$O28=\"\"),\"\",\"self\")","v":""},{"$f":"IF(OR($A24=\"\",Vorgaben!$O28=\"\"),\"\",\"student\")","v":""},{"$f":"IF(OR($A24=\"\",Vorgaben!$O28=\"\"),\"\",Vorgaben!$O28)","v":""}]
[{"$f":"IF(Vorgaben!$K29=\"\",\"\",IF(Vorgaben!$B$6=\"\",Vorgaben!$B$6&Vorgaben!L29&Vorgaben!$B$9,Vorgaben!$B$6&\" \"&Vorgaben!L29&Vorgaben!$B$9))","v":""},"",{"$f":"IF(A25=\"\",\"\",IF(Vorgaben!$B$3=\"\",\"\",Vorgaben!$B$3&\" / \")&IF(Vorgaben!$D$3=\"\",\"\",Vorgaben!$D$3&\" / \")&IF(Vorgaben!$F$3=\"\",\"\",Vorgaben!$F$3&\" / \")&IF(Vorgaben!$H$3=\"\",\"\",Vorgaben!$H$3&\" /\")&IF(Vorgaben!$B$6=\"\",Vorgaben!D29,Vorgaben!D29&\" (\"&Vorgaben!$B$6&\")\"))","v":""},{"$f":"IF(OR($A25=\"\",Vorgaben!$M29=\"\"),\"\",Vorgaben!$M29)","v":""},{"$f":"IF(OR($A25=\"\",Vorgaben!$N$7=\"\"),\"\",\"self\")","v":""},{"$f":"IF(OR($A25=\"\",Vorgaben!$N$7=\"\"),\"\",\"editingteacher\")","v":""},{"$f":"IF(OR($A25=\"\",Vorgaben!$N$7=\"\"),\"\",Vorgaben!$N$7)","v":""},{"$f":"IF(OR($A25=\"\",Vorgaben!$O29=\"\"),\"\",\"self\")","v":""},{"$f":"IF(OR($A25=\"\",Vorgaben!$O29=\"\"),\"\",\"student\")","v":""},{"$f":"IF(OR($A25=\"\",Vorgaben!$O29=\"\"),\"\",Vorgaben!$O29)","v":""}]
[{"$f":"IF(Vorgaben!$K30=\"\",\"\",IF(Vorgaben!$B$6=\"\",Vorgaben!$B$6&Vorgaben!L30&Vorgaben!$B$9,Vorgaben!$B$6&\" \"&Vorgaben!L30&Vorgaben!$B$9))","v":""},"",{"$f":"IF(A26=\"\",\"\",IF(Vorgaben!$B$3=\"\",\"\",Vorgaben!$B$3&\" / \")&IF(Vorgaben!$D$3=\"\",\"\",Vorgaben!$D$3&\" / \")&IF(Vorgaben!$F$3=\"\",\"\",Vorgaben!$F$3&\" / \")&IF(Vorgaben!$H$3=\"\",\"\",Vorgaben!$H$3&\" /\")&IF(Vorgaben!$B$6=\"\",Vorgaben!D30,Vorgaben!D30&\" (\"&Vorgaben!$B$6&\")\"))","v":""},{"$f":"IF(OR($A26=\"\",Vorgaben!$M30=\"\"),\"\",Vorgaben!$M30)","v":""},{"$f":"IF(OR($A26=\"\",Vorgaben!$N$7=\"\"),\"\",\"self\")","v":""},{"$f":"IF(OR($A26=\"\",Vorgaben!$N$7=\"\"),\"\",\"editingteacher\")","v":""},{"$f":"IF(OR($A26=\"\",Vorgaben!$N$7=\"\"),\"\",Vorgaben!$N$7)","v":""},{"$f":"IF(OR($A26=\"\",Vorgaben!$O30=\"\"),\"\",\"self\")","v":""},{"$f":"IF(OR($A26=\"\",Vorgaben!$O30=\"\"),\"\",\"student\")","v":""},{"$f":"IF(OR($A26=\"\",Vorgaben!$O30=\"\"),\"\",Vorgaben!$O30)","v":""}]
[{"$f":"IF(Vorgaben!$K31=\"\",\"\",IF(Vorgaben!$B$6=\"\",Vorgaben!$B$6&Vorgaben!L31&Vorgaben!$B$9,Vorgaben!$B$6&\" \"&Vorgaben!L31&Vorgaben!$B$9))","v":""},"",{"$f":"IF(A27=\"\",\"\",IF(Vorgaben!$B$3=\"\",\"\",Vorgaben!$B$3&\" / \")&IF(Vorgaben!$D$3=\"\",\"\",Vorgaben!$D$3&\" / \")&IF(Vorgaben!$F$3=\"\",\"\",Vorgaben!$F$3&\" / \")&IF(Vorgaben!$H$3=\"\",\"\",Vorgaben!$H$3&\" /\")&IF(Vorgaben!$B$6=\"\",Vorgaben!D31,Vorgaben!D31&\" (\"&Vorgaben!$B$6&\")\"))","v":""},{"$f":"IF(OR($A27=\"\",Vorgaben!$M31=\"\"),\"\",Vorgaben!$M31)","v":""},{"$f":"IF(OR($A27=\"\",Vorgaben!$N$7=\"\"),\"\",\"self\")","v":""},{"$f":"IF(OR($A27=\"\",Vorgaben!$N$7=\"\"),\"\",\"editingteacher\")","v":""},{"$f":"IF(OR($A27=\"\",Vorgaben!$N$7=\"\"),\"\",Vorgaben!$N$7)","v":""},{"$f":"IF(OR($A27=\"\",Vorgaben!$O31=\"\"),\"\",\"self\")","v":""},{"$f":"IF(OR($A27=\"\",Vorgaben!$O31=\"\"),\"\",\"student\")","v":""},{"$f":"IF(OR($A27=\"\",Vorgaben!$O31=\"\"),\"\",Vorgaben!$O31)","v":""}]
[{"$f":"IF(Vorgaben!$K32=\"\",\"\",IF(Vorgaben!$B$6=\"\",Vorgaben!$B$6&Vorgaben!L32&Vorgaben!$B$9,Vorgaben!$B$6&\" \"&Vorgaben!L32&Vorgaben!$B$9))","v":""},"",{"$f":"IF(A28=\"\",\"\",IF(Vorgaben!$B$3=\"\",\"\",Vorgaben!$B$3&\" / \")&IF(Vorgaben!$D$3=\"\",\"\",Vorgaben!$D$3&\" / \")&IF(Vorgaben!$F$3=\"\",\"\",Vorgaben!$F$3&\" / \")&IF(Vorgaben!$H$3=\"\",\"\",Vorgaben!$H$3&\" /\")&IF(Vorgaben!$B$6=\"\",Vorgaben!D32,Vorgaben!D32&\" (\"&Vorgaben!$B$6&\")\"))","v":""},{"$f":"IF(OR($A28=\"\",Vorgaben!$M32=\"\"),\"\",Vorgaben!$M32)","v":""},{"$f":"IF(OR($A28=\"\",Vorgaben!$N$7=\"\"),\"\",\"self\")","v":""},{"$f":"IF(OR($A28=\"\",Vorgaben!$N$7=\"\"),\"\",\"editingteacher\")","v":""},{"$f":"IF(OR($A28=\"\",Vorgaben!$N$7=\"\"),\"\",Vorgaben!$N$7)","v":""},{"$f":"IF(OR($A28=\"\",Vorgaben!$O32=\"\"),\"\",\"self\")","v":""},{"$f":"IF(OR($A28=\"\",Vorgaben!$O32=\"\"),\"\",\"student\")","v":""},{"$f":"IF(OR($A28=\"\",Vorgaben!$O32=\"\"),\"\",Vorgaben!$O32)","v":""}]
[{"$f":"IF(Vorgaben!$K33=\"\",\"\",IF(Vorgaben!$B$6=\"\",Vorgaben!$B$6&Vorgaben!L33&Vorgaben!$B$9,Vorgaben!$B$6&\" \"&Vorgaben!L33&Vorgaben!$B$9))","v":""},"",{"$f":"IF(A29=\"\",\"\",IF(Vorgaben!$B$3=\"\",\"\",Vorgaben!$B$3&\" / \")&IF(Vorgaben!$D$3=\"\",\"\",Vorgaben!$D$3&\" / \")&IF(Vorgaben!$F$3=\"\",\"\",Vorgaben!$F$3&\" / \")&IF(Vorgaben!$H$3=\"\",\"\",Vorgaben!$H$3&\" /\")&IF(Vorgaben!$B$6=\"\",Vorgaben!D33,Vorgaben!D33&\" (\"&Vorgaben!$B$6&\")\"))","v":""},{"$f":"IF(OR($A29=\"\",Vorgaben!$M33=\"\"),\"\",Vorgaben!$M33)","v":""},{"$f":"IF(OR($A29=\"\",Vorgaben!$N$7=\"\"),\"\",\"self\")","v":""},{"$f":"IF(OR($A29=\"\",Vorgaben!$N$7=\"\"),\"\",\"editingteacher\")","v":""},{"$f":"IF(OR($A29=\"\",Vorgaben!$N$7=\"\"),\"\",Vorgaben!$N$7)","v":""},{"$f":"IF(OR($A29=\"\",Vorgaben!$O33=\"\"),\"\",\"self\")","v":""},{"$f":"IF(OR($A29=\"\",Vorgaben!$O33=\"\"),\"\",\"student\")","v":""},{"$f":"IF(OR($A29=\"\",Vorgaben!$O33=\"\"),\"\",Vorgaben!$O33)","v":""}]
[{"$f":"IF(Vorgaben!$K34=\"\",\"\",IF(Vorgaben!$B$6=\"\",Vorgaben!$B$6&Vorgaben!L34&Vorgaben!$B$9,Vorgaben!$B$6&\" \"&Vorgaben!L34&Vorgaben!$B$9))","v":""},"",{"$f":"IF(A30=\"\",\"\",IF(Vorgaben!$B$3=\"\",\"\",Vorgaben!$B$3&\" / \")&IF(Vorgaben!$D$3=\"\",\"\",Vorgaben!$D$3&\" / \")&IF(Vorgaben!$F$3=\"\",\"\",Vorgaben!$F$3&\" / \")&IF(Vorgaben!$H$3=\"\",\"\",Vorgaben!$H$3&\" /\")&IF(Vorgaben!$B$6=\"\",Vorgaben!D34,Vorgaben!D34&\" (\"&Vorgaben!$B$6&\")\"))","v":""},{"$f":"IF(OR($A30=\"\",Vorgaben!$M34=\"\"),\"\",Vorgaben!$M34)","v":""},{"$f":"IF(OR($A30=\"\",Vorgaben!$N$7=\"\"),\"\",\"self\")","v":""},{"$f":"IF(OR($A30=\"\",Vorgaben!$N$7=\"\"),\"\",\"editingteacher\")","v":""},{"$f":"IF(OR($A30=\"\",Vorgaben!$N$7=\"\"),\"\",Vorgaben!$N$7)","v":""},{"$f":"IF(OR($A30=\"\",Vorgaben!$O34=\"\"),\"\",\"self\")","v":""},{"$f":"IF(OR($A30=\"\",Vorgaben!$O34=\"\"),\"\",\"student\")","v":""},{"$f":"IF(OR($A30=\"\",Vorgaben!$O34=\"\"),\"\",Vorgaben!$O34)","v":""}]
[{"$f":"IF(Vorgaben!$K35=\"\",\"\",IF(Vorgaben!$B$6=\"\",Vorgaben!$B$6&Vorgaben!L35&Vorgaben!$B$9,Vorgaben!$B$6&\" \"&Vorgaben!L35&Vorgaben!$B$9))","v":""},"",{"$f":"IF(A31=\"\",\"\",IF(Vorgaben!$B$3=\"\",\"\",Vorgaben!$B$3&\" / \")&IF(Vorgaben!$D$3=\"\",\"\",Vorgaben!$D$3&\" / \")&IF(Vorgaben!$F$3=\"\",\"\",Vorgaben!$F$3&\" / \")&IF(Vorgaben!$H$3=\"\",\"\",Vorgaben!$H$3&\" /\")&IF(Vorgaben!$B$6=\"\",Vorgaben!D35,Vorgaben!D35&\" (\"&Vorgaben!$B$6&\")\"))","v":""},{"$f":"IF(OR($A31=\"\",Vorgaben!$M35=\"\"),\"\",Vorgaben!$M35)","v":""},{"$f":"IF(OR($A31=\"\",Vorgaben!$N$7=\"\"),\"\",\"self\")","v":""},{"$f":"IF(OR($A31=\"\",Vorgaben!$N$7=\"\"),\"\",\"editingteacher\")","v":""},{"$f":"IF(OR($A31=\"\",Vorgaben!$N$7=\"\"),\"\",Vorgaben!$N$7)","v":""},{"$f":"IF(OR($A31=\"\",Vorgaben!$O35=\"\"),\"\",\"self\")","v":""},{"$f":"IF(OR($A31=\"\",Vorgaben!$O35=\"\"),\"\",\"student\")","v":""},{"$f":"IF(OR($A31=\"\",Vorgaben!$O35=\"\"),\"\",Vorgaben!$O35)","v":""}]

{"sheet":"PDF Diffkurse","index":3,"n_rows":32,"n_cols":3,"rows_kept":32,"cut":false,"hidden":false,"merged":[[0,1,0,2]]}
[{"$f":"\"Diffkurse & Ags der Stufe \"&Vorgaben!B9","v":"Diffkurse & Ags der Stufe  "},"Sind Passwörter angegeben, so wurde der Kurs mit der Möglichkeit der Selbsteinschreibung importiert."]
["Klassenkursname ","Passwort Lehrer/in","Passwort Schüler/in"]
[{"$f":"IF(Vorgaben!$K6=\"\",\"\",Diffkurse!B2)","v":"Diffkurs "},{"$f":"IF(OR($A3=\"\",Vorgaben!$N$7=\"\"),\"\",Vorgaben!$N$7)","v":"djv5456+"},{"$f":"IF(OR($A3=\"\",Vorgaben!$O6=\"\"),\"\",Vorgaben!$O6)","v":"diff#05"}]
[{"$f":"IF(Vorgaben!$K7=\"\",\"\",Diffkurse!B3)","v":""},{"$f":"IF(OR($A4=\"\",Vorgaben!$N$7=\"\"),\"\",Vorgaben!$N$7)","v":""},{"$f":"IF(OR($A4=\"\",Vorgaben!$O7=\"\"),\"\",Vorgaben!$O7)","v":""}]
[{"$f":"IF(Vorgaben!$K8=\"\",\"\",Diffkurse!B4)","v":""},{"$f":"IF(OR($A5=\"\",Vorgaben!$N$7=\"\"),\"\",Vorgaben!$N$7)","v":""},{"$f":"IF(OR($A5=\"\",Vorgaben!$O8=\"\"),\"\",Vorgaben!$O8)","v":""}]
[{"$f":"IF(Vorgaben!$K9=\"\",\"\",Diffkurse!B5)","v":""},{"$f":"IF(OR($A6=\"\",Vorgaben!$N$7=\"\"),\"\",Vorgaben!$N$7)","v":""},{"$f":"IF(OR($A6=\"\",Vorgaben!$O9=\"\"),\"\",Vorgaben!$O9)","v":""}]
[{"$f":"IF(Vorgaben!$K10=\"\",\"\",Diffkurse!B6)","v":""},{"$f":"IF(OR($A7=\"\",Vorgaben!$N$7=\"\"),\"\",Vorgaben!$N$7)","v":""},{"$f":"IF(OR($A7=\"\",Vorgaben!$O10=\"\"),\"\",Vorgaben!$O10)","v":""}]
[{"$f":"IF(Vorgaben!$K11=\"\",\"\",Diffkurse!B7)","v":""},{"$f":"IF(OR($A8=\"\",Vorgaben!$N$7=\"\"),\"\",Vorgaben!$N$7)","v":""},{"$f":"IF(OR($A8=\"\",Vorgaben!$O11=\"\"),\"\",Vorgaben!$O11)","v":""}]
[{"$f":"IF(Vorgaben!$K12=\"\",\"\",Diffkurse!B8)","v":""},{"$f":"IF(OR($A9=\"\",Vorgaben!$N$7=\"\"),\"\",Vorgaben!$N$7)","v":""},{"$f":"IF(OR($A9=\"\",Vorgaben!$O12=\"\"),\"\",Vorgaben!$O12)","v":""}]
[{"$f":"IF(Vorgaben!$K13=\"\",\"\",Diffkurse!B9)","v":""},{"$f":"IF(OR($A10=\"\",Vorgaben!$N$7=\"\"),\"\",Vorgaben!$N$7)","v":""},{"$f":"IF(OR($A10=\"\",Vorgaben!$O13=\"\"),\"\",Vorgaben!$O13)","v":""}]
[{"$f":"IF(Vorgaben!$K14=\"\",\"\",Diffkurse!B10)","v":""},{"$f":"IF(OR($A11=\"\",Vorgaben!$N$7=\"\"),\"\",Vorgaben!$N$7)","v":""},{"$f":"IF(OR($A11=\"\",Vorgaben!$O14=\"\"),\"\",Vorgaben!$O14)","v":""}]
[{"$f":"IF(Vorgaben!$K15=\"\",\"\",Diffkurse!B11)","v":""},{"$f":"IF(OR($A12=\"\",Vorgaben!$N$7=\"\"),\"\",Vorgaben!$N$7)","v":""},{"$f":"IF(OR($A12=\"\",Vorgaben!$O15=\"\"),\"\",Vorgaben!$O15)","v":""}]
[{"$f":"IF(Vorgaben!$K16=\"\",\"\",Diffkurse!B12)","v":""},{"$f":"IF(OR($A13=\"\",Vorgaben!$N$7=\"\"),\"\",Vorgaben!$N$7)","v":""},{"$f":"IF(OR($A13=\"\",Vorgaben!$O16=\"\"),\"\",Vorgaben!$O16)","v":""}]
[{"$f":"IF(Vorgaben!$K17=\"\",\"\",Diffkurse!B13)","v":""},{"$f":"IF(OR($A14=\"\",Vorgaben!$N$7=\"\"),\"\",Vorgaben!$N$7)","v":""},{"$f":"IF(OR($A14=\"\",Vorgaben!$O17=\"\"),\"\",Vorgaben!$O17)","v":""}]
[{"$f":"IF(Vorgaben!$K18=\"\",\"\",Diffkurse!B14)","v":""},{"$f":"IF(OR($A15=\"\",Vorgaben!$N$7=\"\"),\"\",Vorgaben!$N$7)","v":""},{"$f":"IF(OR($A15=\"\",Vorgaben!$O18=\"\"),\"\",Vorgaben!$O18)","v":""}]
[{"$f":"IF(Vorgaben!$K19=\"\",\"\",Diffkurse!B15)","v":""},{"$f":"IF(OR($A16=\"\",Vorgaben!$N$7=\"\"),\"\",Vorgaben!$N$7)","v":""},{"$f":"IF(OR($A16=\"\",Vorgaben!$O19=\"\"),\"\",Vorgaben!$O19)","v":""}]
[{"$f":"IF(Vorgaben!$K20=\"\",\"\",Diffkurse!B16)","v":""},{"$f":"IF(OR($A17=\"\",Vorgaben!$N$7=\"\"),\"\",Vorgaben!$N$7)","v":""},{"$f":"IF(OR($A17=\"\",Vorgaben!$O20=\"\"),\"\",Vorgaben!$O20)","v":""}]
[{"$f":"IF(Vorgaben!$K21=\"\",\"\",Diffkurse!B17)","v":""},{"$f":"IF(OR($A18=\"\",Vorgaben!$N$7=\"\"),\"\",Vorgaben!$N$7)","v":""},{"$f":"IF(OR($A18=\"\",Vorgaben!$O21=\"\"),\"\",Vorgaben!$O21)","v":""}]
[{"$f":"IF(Vorgaben!$K22=\"\",\"\",Diffkurse!B18)","v":""},{"$f":"IF(OR($A19=\"\",Vorgaben!$N$7=\"\"),\"\",Vorgaben!$N$7)","v":""},{"$f":"IF(OR($A19=\"\",Vorgaben!$O22=\"\"),\"\",Vorgaben!$O22)","v":""}]
[{"$f":"IF(Vorgaben!$K23=\"\",\"\",Diffkurse!B19)","v":""},{"$f":"IF(OR($A20=\"\",Vorgaben!$N$7=\"\"),\"\",Vorgaben!$N$7)","v":""},{"$f":"IF(OR($A20=\"\",Vorgaben!$O23=\"\"),\"\",Vorgaben!$O23)","v":""}]
[{"$f":"IF(Vorgaben!$K24=\"\",\"\",Diffkurse!B20)","v":""},{"$f":"IF(OR($A21=\"\",Vorgaben!$N$7=\"\"),\"\",Vorgaben!$N$7)","v":""},{"$f":"IF(OR($A21=\"\",Vorgaben!$O24=\"\"),\"\",Vorgaben!$O24)","v":""}]
[{"$f":"IF(Vorgaben!$K25=\"\",\"\",Diffkurse!B21)","v":""},{"$f":"IF(OR($A22=\"\",Vorgaben!$N$7=\"\"),\"\",Vorgaben!$N$7)","v":""},{"$f":"IF(OR($A22=\"\",Vorgaben!$O25=\"\"),\"\",Vorgaben!$O25)","v":""}]
[{"$f":"IF(Vorgaben!$K26=\"\",\"\",Diffkurse!B22)","v":""},{"$f":"IF(OR($A23=\"\",Vorgaben!$N$7=\"\"),\"\",Vorgaben!$N$7)","v":""},{"$f":"IF(OR($A23=\"\",Vorgaben!$O26=\"\"),\"\",Vorgaben!$O26)","v":""}]
[{"$f":"IF(Vorgaben!$K27=\"\",\"\",Diffkurse!B23)","v":""},{"$f":"IF(OR($A24=\"\",Vorgaben!$N$7=\"\"),\"\",Vorgaben!$N$7)","v":""},{"$f":"IF(OR($A24=\"\",Vorgaben!$O27=\"\"),\"\",Vorgaben!$O27)","v":""}]
[{"$f":"IF(Vorgaben!$K28=\"\",\"\",Diffkurse!B24)","v":""},{"$f":"IF(OR($A25=\"\",Vorgaben!$N$7=\"\"),\"\",Vorgaben!$N$7)","v":""},{"$f":"IF(OR($A25=\"\",Vorgaben!$O28=\"\"),\"\",Vorgaben!$O28)","v":""}]
[{"$f":"IF(Vorgaben!$K29=\"\",\"\",Diffkurse!B25)","v":""},{"$f":"IF(OR($A26=\"\",Vorgaben!$N$7=\"\"),\"\",Vorgaben!$N$7)","v":""},{"$f":"IF(OR($A26=\"\",Vorgaben!$O29=\"\"),\"\",Vorgaben!$O29)","v":""}]
[{"$f":"IF(Vorgaben!$K30=\"\",\"\",Diffkurse!B26)","v":""},{"$f":"IF(OR($A27=\"\",Vorgaben!$N$7=\"\"),\"\",Vorgaben!$N$7)","v":""},{"$f":"IF(OR($A27=\"\",Vorgaben!$O30=\"\"),\"\",Vorgaben!$O30)","v":""}]
[{"$f":"IF(Vorgaben!$K31=\"\",\"\",Diffkurse!B27)","v":""},{"$f":"IF(OR($A28=\"\",Vorgaben!$N$7=\"\"),\"\",Vorgaben!$N$7)","v":""},{"$f":"IF(OR($A28=\"\",Vorgaben!$O31=\"\"),\"\",Vorgaben!$O31)","v":""}]
[{"$f":"IF(Vorgaben!$K32=\"\",\"\",Diffkurse!B28)","v":""},{"$f":"IF(OR($A29=\"\",Vorgaben!$N$7=\"\"),\"\",Vorgaben!$N$7)","v":""},{"$f":"IF(OR($A29=\"\",Vorgaben!$O32=\"\"),\"\",Vorgaben!$O32)","v":""}]
[{"$f":"IF(Vorgaben!$K33=\"\",\"\",Diffkurse!B29)","v":""},{"$f":"IF(OR($A30=\"\",Vorgaben!$N$7=\"\"),\"\",Vorgaben!$N$7)","v":""},{"$f":"IF(OR($A30=\"\",Vorgaben!$O33=\"\"),\"\",Vorgaben!$O33)","v":""}]
[{"$f":"IF(Vorgaben!$K34=\"\",\"\",Diffkurse!B30)","v":""},{"$f":"IF(OR($A31=\"\",Vorgaben!$N$7=\"\"),\"\",Vorgaben!$N$7)","v":""},{"$f":"IF(OR($A31=\"\",Vorgaben!$O34=\"\"),\"\",Vorgaben!$O34)","v":""}]
[{"$f":"IF(Vorgaben!$K35=\"\",\"\",Diffkurse!B31)","v":""},{"$f":"IF(OR($A32=\"\",Vorgaben!$N$7=\"\"),\"\",Vorgaben!$N$7)","v":""},{"$f":"IF(OR($A32=\"\",Vorgaben!$O35=\"\"),\"\",Vorgaben!$O35)","v":""}]

{"sheet":"PDF Stufe 1","index":4,"n_rows":9,"n_cols":3,"rows_kept":9,"cut":false,"hidden":false,"merged":[[0,1,0,2]]}
[{"$f":"\"Klassenkurse der Stufe \"&Vorgaben!D6","v":"Klassenkurse der Stufe Stufe 05"},"Sind Passwörter angegeben, so wurde der Kurs mit der Möglichkeit der Selbsteinschreibung importiert."]
["Klassenkursname ","Passwort Lehrer/in","Passwort Schüler/in"]
[{"$f":"IF(Klassenkurse!A2<>\"\",Klassenkurse!A2,\"\")","v":"Klasse 5a"},{"$f":"IF(Klassenkurse!G2<>\"\",Klassenkurse!G2,\"\")","v":"djv5456+"},{"$f":"IF(Klassenkurse!J2<>\"\",Klassenkurse!J2,\"\")","v":""}]
[{"$f":"IF(Klassenkurse!A3<>\"\",Klassenkurse!A3,\"\")","v":"Klasse 5b"},{"$f":"IF(Klassenkurse!G3<>\"\",Klassenkurse!G3,\"\")","v":"djv5456+"},{"$f":"IF(Klassenkurse!J3<>\"\",Klassenkurse!J3,\"\")","v":""}]
[{"$f":"IF(Klassenkurse!A4<>\"\",Klassenkurse!A4,\"\")","v":"Klasse 5c"},{"$f":"IF(Klassenkurse!G4<>\"\",Klassenkurse!G4,\"\")","v":"djv5456+"},{"$f":"IF(Klassenkurse!J4<>\"\",Klassenkurse!J4,\"\")","v":""}]
[{"$f":"IF(Klassenkurse!A5<>\"\",Klassenkurse!A5,\"\")","v":"Klasse 5d"},{"$f":"IF(Klassenkurse!G5<>\"\",Klassenkurse!G5,\"\")","v":"djv5456+"},{"$f":"IF(Klassenkurse!J5<>\"\",Klassenkurse!J5,\"\")","v":""}]
[{"$f":"IF(Klassenkurse!A6<>\"\",Klassenkurse!A6,\"\")","v":""},{"$f":"IF(Klassenkurse!G6<>\"\",Klassenkurse!G6,\"\")","v":""},{"$f":"IF(Klassenkurse!J6<>\"\",Klassenkurse!J6,\"\")","v":""}]
[{"$f":"IF(Klassenkurse!A7<>\"\",Klassenkurse!A7,\"\")","v":""},{"$f":"IF(Klassenkurse!G7<>\"\",Klassenkurse!G7,\"\")","v":""},{"$f":"IF(Klassenkurse!J7<>\"\",Klassenkurse!J7,\"\")","v":""}]
[{"$f":"IF(Klassenkurse!A8<>\"\",Klassenkurse!A8,\"\")","v":""},{"$f":"IF(Klassenkurse!G8<>\"\",Klassenkurse!G8,\"\")","v":""},{"$f":"IF(Klassenkurse!J8<>\"\",Klassenkurse!J8,\"\")","v":""}]

{"sheet":"PDF Stufe 2","index":5,"n_rows":9,"n_cols":3,"rows_kept":9,"cut":false,"hidden":false,"merged":[[0,1,0,2]]}
[{"$f":"\"Klassenkurse der Stufe \"&Vorgaben!D7","v":"Klassenkurse der Stufe Stufe 06"},"Sind Passwörter angegeben, so wurde der Kurs mit der Möglichkeit der Selbsteinschreibung importiert."]
["Klassenkursname ","Passwort Lehrer/in","Passwort Schüler/in"]
[{"$f":"IF(Klassenkurse!A10<>\"\",Klassenkurse!A10,\"\")","v":"Klasse 6a"},{"$f":"IF(Klassenkurse!G10<>\"\",Klassenkurse!G10,\"\")","v":"djv5456+"},{"$f":"IF(Klassenkurse!J10<>\"\",Klassenkurse!J10,\"\")","v":""}]
[{"$f":"IF(Klassenkurse!A11<>\"\",Klassenkurse!A11,\"\")","v":"Klasse 6b"},{"$f":"IF(Klassenkurse!G11<>\"\",Klassenkurse!G11,\"\")","v":"djv5456+"},{"$f":"IF(Klassenkurse!J11<>\"\",Klassenkurse!J11,\"\")","v":""}]
[{"$f":"IF(Klassenkurse!A12<>\"\",Klassenkurse!A12,\"\")","v":"Klasse 6c"},{"$f":"IF(Klassenkurse!G12<>\"\",Klassenkurse!G12,\"\")","v":"djv5456+"},{"$f":"IF(Klassenkurse!J12<>\"\",Klassenkurse!J12,\"\")","v":""}]
[{"$f":"IF(Klassenkurse!A13<>\"\",Klassenkurse!A13,\"\")","v":"Klasse 6d"},{"$f":"IF(Klassenkurse!G13<>\"\",Klassenkurse!G13,\"\")","v":"djv5456+"},{"$f":"IF(Klassenkurse!J13<>\"\",Klassenkurse!J13,\"\")","v":""}]
[{"$f":"IF(Klassenkurse!A14<>\"\",Klassenkurse!A14,\"\")","v":""},{"$f":"IF(Klassenkurse!G14<>\"\",Klassenkurse!G14,\"\")","v":""},{"$f":"IF(Klassenkurse!J14<>\"\",Klassenkurse!J14,\"\")","v":""}]
[{"$f":"IF(Klassenkurse!A15<>\"\",Klassenkurse!A15,\"\")","v":""},{"$f":"IF(Klassenkurse!G15<>\"\",Klassenkurse!G15,\"\")","v":""},{"$f":"IF(Klassenkurse!J15<>\"\",Klassenkurse!J15,\"\")","v":""}]
[{"$f":"IF(Klassenkurse!A16<>\"\",Klassenkurse!A16,\"\")","v":""},{"$f":"IF(Klassenkurse!G16<>\"\",Klassenkurse!G16,\"\")","v":""},{"$f":"IF(Klassenkurse!J16<>\"\",Klassenkurse!J16,\"\")","v":""}]

{"sheet":"PDF Stufe 3","index":6,"n_rows":9,"n_cols":3,"rows_kept":9,"cut":false,"hidden":false,"merged":[[0,1,0,2]]}
[{"$f":"\"Klassenkurse der Stufe \"&Vorgaben!D8","v":"Klassenkurse der Stufe Stufe 07"},"Sind Passwörter angegeben, so wurde der Kurs mit der Möglichkeit der Selbsteinschreibung importiert."]
["Klassenkursname ","Passwort Lehrer/in","Passwort Schüler/in"]
[{"$f":"IF(Klassenkurse!A18<>\"\",Klassenkurse!A18,\"\")","v":"Klasse 7a"},{"$f":"IF(Klassenkurse!G18<>\"\",Klassenkurse!G18,\"\")","v":"djv5456+"},{"$f":"IF(Klassenkurse!J18<>\"\",Klassenkurse!J18,\"\")","v":""}]
[{"$f":"IF(Klassenkurse!A19<>\"\",Klassenkurse!A19,\"\")","v":"Klasse 7b"},{"$f":"IF(Klassenkurse!G19<>\"\",Klassenkurse!G19,\"\")","v":"djv5456+"},{"$f":"IF(Klassenkurse!J19<>\"\",Klassenkurse!J19,\"\")","v":""}]
[{"$f":"IF(Klassenkurse!A20<>\"\",Klassenkurse!A20,\"\")","v":"Klasse 7c"},{"$f":"IF(Klassenkurse!G20<>\"\",Klassenkurse!G20,\"\")","v":"djv5456+"},{"$f":"IF(Klassenkurse!J20<>\"\",Klassenkurse!J20,\"\")","v":""}]
[{"$f":"IF(Klassenkurse!A21<>\"\",Klassenkurse!A21,\"\")","v":"Klasse 7d"},{"$f":"IF(Klassenkurse!G21<>\"\",Klassenkurse!G21,\"\")","v":"djv5456+"},{"$f":"IF(Klassenkurse!J21<>\"\",Klassenkurse!J21,\"\")","v":""}]
[{"$f":"IF(Klassenkurse!A22<>\"\",Klassenkurse!A22,\"\")","v":""},{"$f":"IF(Klassenkurse!G22<>\"\",Klassenkurse!G22,\"\")","v":""},{"$f":"IF(Klassenkurse!J22<>\"\",Klassenkurse!J22,\"\")","v":""}]
[{"$f":"IF(Klassenkurse!A23<>\"\",Klassenkurse!A23,\"\")","v":""},{"$f":"IF(Klassenkurse!G23<>\"\",Klassenkurse!G23,\"\")","v":""},{"$f":"IF(Klassenkurse!J23<>\"\",Klassenkurse!J23,\"\")","v":""}]
[{"$f":"IF(Klassenkurse!A24<>\"\",Klassenkurse!A24,\"\")","v":""},{"$f":"IF(Klassenkurse!G24<>\"\",Klassenkurse!G24,\"\")","v":""},{"$f":"IF(Klassenkurse!J24<>\"\",Klassenkurse!J24,\"\")","v":""}]

{"sheet":"PDF Stufe 4","index":7,"n_rows":9,"n_cols":3,"rows_kept":9,"cut":false,"hidden":false,"merged":[[0,1,0,2]]}
[{"$f":"\"Klassenkurse der Sufe \"&Vorgaben!D9","v":"Klassenkurse der Sufe "},"Sind Passwörter angegeben, so wurde der Kurs mit der Möglichkeit der Selbsteinschreibung importiert."]
["Klassenkursname ","Passwort Lehrer/in","Passwort Schüler/in"]
[{"$f":"IF(Klassenkurse!A26<>\"\",Klassenkurse!A26,\"\")","v":""},{"$f":"IF(Klassenkurse!G26<>\"\",Klassenkurse!G26,\"\")","v":""},{"$f":"IF(Klassenkurse!J26<>\"\",Klassenkurse!J26,\"\")","v":""}]
[{"$f":"IF(Klassenkurse!A27<>\"\",Klassenkurse!A27,\"\")","v":""},{"$f":"IF(Klassenkurse!G27<>\"\",Klassenkurse!G27,\"\")","v":""},{"$f":"IF(Klassenkurse!J27<>\"\",Klassenkurse!J27,\"\")","v":""}]
[{"$f":"IF(Klassenkurse!A28<>\"\",Klassenkurse!A28,\"\")","v":""},{"$f":"IF(Klassenkurse!G28<>\"\",Klassenkurse!G28,\"\")","v":""},{"$f":"IF(Klassenkurse!J28<>\"\",Klassenkurse!J28,\"\")","v":""}]
[{"$f":"IF(Klassenkurse!A29<>\"\",Klassenkurse!A29,\"\")","v":""},{"$f":"IF(Klassenkurse!G29<>\"\",Klassenkurse!G29,\"\")","v":""},{"$f":"IF(Klassenkurse!J29<>\"\",Klassenkurse!J29,\"\")","v":""}]
[{"$f":"IF(Klassenkurse!A30<>\"\",Klassenkurse!A30,\"\")","v":""},{"$f":"IF(Klassenkurse!G30<>\"\",Klassenkurse!G30,\"\")","v":""},{"$f":"IF(Klassenkurse!J30<>\"\",Klassenkurse!J30,\"\")","v":""}]
[{"$f":"IF(Klassenkurse!A31<>\"\",Klassenkurse!A31,\"\")","v":""},{"$f":"IF(Klassenkurse!G31<>\"\",Klassenkurse!G31,\"\")","v":""},{"$f":"IF(Klassenkurse!J31<>\"\",Klassenkurse!J31,\"\")","v":""}]
[{"$f":"IF(Klassenkurse!A32<>\"\",Klassenkurse!A32,\"\")","v":""},{"$f":"IF(Klassenkurse!G32<>\"\",Klassenkurse!G32,\"\")","v":""},{"$f":"IF(Klassenkurse!J32<>\"\",Klassenkurse!J32,\"\")","v":""}]

{"sheet":"PDF Stufe 5","index":8,"n_rows":9,"n_cols":3,"rows_kept":9,"cut":false,"hidden":false,"merged":[[0,1,0,2]]}
[{"$f":"\"Klassenkurse der Stufe \"&Vorgaben!D10","v":"Klassenkurse der Stufe "},"Sind Passwörter angegeben, so wurde der Kurs mit der Möglichkeit der Selbsteinschreibung importiert."]
["Klassenkursname ","Passwort Lehrer/in","Passwort Schüler/in"]
[{"$f":"IF(Klassenkurse!A34<>\"\",Klassenkurse!A34,\"\")","v":""},{"$f":"IF(Klassenkurse!G34<>\"\",Klassenkurse!G34,\"\")","v":""},{"$f":"IF(Klassenkurse!J34<>\"\",Klassenkurse!J34,\"\")","v":""}]
[{"$f":"IF(Klassenkurse!A35<>\"\",Klassenkurse!A35,\"\")","v":""},{"$f":"IF(Klassenkurse!G35<>\"\",Klassenkurse!G35,\"\")","v":""},{"$f":"IF(Klassenkurse!J35<>\"\",Klassenkurse!J35,\"\")","v":""}]
[{"$f":"IF(Klassenkurse!A36<>\"\",Klassenkurse!A36,\"\")","v":""},{"$f":"IF(Klassenkurse!G36<>\"\",Klassenkurse!G36,\"\")","v":""},{"$f":"IF(Klassenkurse!J36<>\"\",Klassenkurse!J36,\"\")","v":""}]
[{"$f":"IF(Klassenkurse!A37<>\"\",Klassenkurse!A37,\"\")","v":""},{"$f":"IF(Klassenkurse!G37<>\"\",Klassenkurse!G37,\"\")","v":""},{"$f":"IF(Klassenkurse!J37<>\"\",Klassenkurse!J37,\"\")","v":""}]
[{"$f":"IF(Klassenkurse!A38<>\"\",Klassenkurse!A38,\"\")","v":""},{"$f":"IF(Klassenkurse!G38<>\"\",Klassenkurse!G38,\"\")","v":""},{"$f":"IF(Klassenkurse!J38<>\"\",Klassenkurse!J38,\"\")","v":""}]
[{"$f":"IF(Klassenkurse!A39<>\"\",Klassenkurse!A39,\"\")","v":""},{"$f":"IF(Klassenkurse!G39<>\"\",Klassenkurse!G39,\"\")","v":""},{"$f":"IF(Klassenkurse!J39<>\"\",Klassenkurse!J39,\"\")","v":""}]
[{"$f":"IF(Klassenkurse!A40<>\"\",Klassenkurse!A40,\"\")","v":""},{"$f":"IF(Klassenkurse!G40<>\"\",Klassenkurse!G40,\"\")","v":""},{"$f":"IF(Klassenkurse!J40<>\"\",Klassenkurse!J40,\"\")","v":""}]

{"sheet":"PDF Stufee 6","index":9,"n_rows":9,"n_cols":3,"rows_kept":9,"cut":false,"hidden":false,"merged":[[0,1,0,2]]}
[{"$f":"\"Klassenkurse der Stufe \"&Vorgaben!D11","v":"Klassenkurse der Stufe "},"Sind Passwörter angegeben, so wurde der Kurs mit der Möglichkeit der Selbsteinschreibung importiert."]
["Klassenkursname ","Passwort Lehrer/in","Passwort Schüler/in"]
[{"$f":"IF(Klassenkurse!A42<>\"\",Klassenkurse!A42,\"\")","v":""},{"$f":"IF(Klassenkurse!G42<>\"\",Klassenkurse!G42,\"\")","v":""},{"$f":"IF(Klassenkurse!J42<>\"\",Klassenkurse!J42,\"\")","v":""}]
[{"$f":"IF(Klassenkurse!A43<>\"\",Klassenkurse!A43,\"\")","v":""},{"$f":"IF(Klassenkurse!G43<>\"\",Klassenkurse!G43,\"\")","v":""},{"$f":"IF(Klassenkurse!J43<>\"\",Klassenkurse!J43,\"\")","v":""}]
[{"$f":"IF(Klassenkurse!A44<>\"\",Klassenkurse!A44,\"\")","v":""},{"$f":"IF(Klassenkurse!G44<>\"\",Klassenkurse!G44,\"\")","v":""},{"$f":"IF(Klassenkurse!J44<>\"\",Klassenkurse!J44,\"\")","v":""}]
[{"$f":"IF(Klassenkurse!A45<>\"\",Klassenkurse!A45,\"\")","v":""},{"$f":"IF(Klassenkurse!G45<>\"\",Klassenkurse!G45,\"\")","v":""},{"$f":"IF(Klassenkurse!J45<>\"\",Klassenkurse!J45,\"\")","v":""}]
[{"$f":"IF(Klassenkurse!A46<>\"\",Klassenkurse!A46,\"\")","v":""},{"$f":"IF(Klassenkurse!G46<>\"\",Klassenkurse!G46,\"\")","v":""},{"$f":"IF(Klassenkurse!J46<>\"\",Klassenkurse!J46,\"\")","v":""}]
[{"$f":"IF(Klassenkurse!A47<>\"\",Klassenkurse!A47,\"\")","v":""},{"$f":"IF(Klassenkurse!G47<>\"\",Klassenkurse!G47,\"\")","v":""},{"$f":"IF(Klassenkurse!J47<>\"\",Klassenkurse!J47,\"\")","v":""}]
[{"$f":"IF(Klassenkurse!A48<>\"\",Klassenkurse!A48,\"\")","v":""},{"$f":"IF(Klassenkurse!G48<>\"\",Klassenkurse!G48,\"\")","v":""},{"$f":"IF(Klassenkurse!J48<>\"\",Klassenkurse!J48,\"\")","v":""}]