{"text_format":"1","workbook":"xlsx","n_sheets":10,"sheets":["Vorgaben","Klassenkurse","Diffkurse","PDF Diffkurse","PDF Klasse 1","PDF Klasse 2","PDF Klasse 3","PDF Klasse 4","PDF Klasse 5","PDF Klasse 6"],"not_rendered":{"charts":0,"images":0,"macros":1,"external_links":0,"defined_names":9,"comments":0,"pivot_tables":0},"unopened":[],"bounds":{"document_bytes":16777216,"sheet_cells":100000,"rows_first":2000,"rows_last":500,"rows_between":2000,"halvings":0,"cell_chars":16384,"cell_head_chars":4096},"cells_cut":0,"cells_raw":0,"read":"whole","date_system":"1900"}

{"sheet":"Vorgaben","index":0,"n_rows":18,"n_cols":14,"rows_kept":18,"cut":false,"hidden":false,"merged":[[1,7,1,10]]}
["Vorgabenseite",null,null,"Sie brauchen nur diese Seite zu füllen, die restlichen Tabellenblätter füllen sich dann passend für den Export."]
[null,"Verzeichnisse oberhalb des Klassenordners",null,null,null,null,null,"Das Verzeichnis für die Klasse wird automatisch angehängt\n(= Klassenbezeichnung). Dieses bitte hier nicht angeben."]
[null,"Unterricht","/","2020-21","/","Stufe 05","/"]
[null,"Stammverzeichnis",null,"Jahr",null,"Stufe",null,null,null,null,null,null,null,"ggf. Kurspasswörter"]
[null,"Schuljahr (Präfix)",null,"Klassen",null,null,"Klassenkurs Fach","ggf. Volagekurs","ggf. Passwort Klassenkurs ",null,"Kurse","ggf. Vorlagekurs","Passwort Kurs","Schüler"]
[null,"2020-21",null,"05a","z.B. 05a",null,"Klassenraum","VorlageKlasse","Lehrer",null,"Ev. Religion 1","VorlageFach","Lehrer"]
[null,null,null,"05b","05b",null,"Deutsch","VorlageFach","djv5456+",null,"Kath. Religion 1","VorlageFach","djv5456+"]
[null,"Stufe",null,"05c","05c",null,"Englisch","VorlageEnglisch",null,null,"PPL 1","VorlageFach"]
[null,"05",null,null,null,null,"Mathematik","VorlageFach",null,null,null,null,"Um Fremdein-"]
[null,"für Diffkurse",null,null,null,null,"Biologie","VorlageFach",null,null,null,null,"schreibung zu"]
[null,null,null,null,null,null,"Physik","VorlageFach","ggf.",null,null,null,"verhindern, ist für"]
[null,null,null,null,null,null,"Sport","VorlageFach","Passwort Klassenkurs",null,null,null,"Schüler ein Passwort"]
[null,"Wenn Sie Vorlagekurse verwenden möchten,",null,null,null,null,null,null,"Schüler",null,null,null,"je Kurs empfophlen"]
[null,"so ist es sinnvoll, nicht mehr als zwei Klassen"]
[null,"in die Datei einzuzpflegen. Logineo LMS kommt"]
[null,"sonst an seine Grenzen und bricht den Import-",null,null,null,null,null,null,"Da alle Schüler auch alle"]
[null,"Vorgang ab.",null,null,null,null,null,null,"Fächer haben, reicht hier "]
[null,null,null,null,null,null,null,null,"ein Passwort."]

{"sheet":"Klassenkurse","index":1,"n_rows":51,"n_cols":10,"rows_kept":51,"cut":false,"hidden":false,"merged":[]}
["shortname","fullname","category_path","templatecourse","enrolment_1","enrolment_1_role","enrolment_1_password","enrolement_2","enrolement_2_role","enrolement_2_passwort"]
[{"$f":"IF(OR(Vorgaben!$D$6=\"\",Vorgaben!$G6=\"\"),\"\",IF(Vorgaben!$B$6=\"\",Vorgaben!$D$6&\" \"&Vorgaben!$G6,Vorgaben!$B$6&\" \"&Vorgaben!$D$6&\" \"&Vorgaben!$G6))","v":"2020-21 05a Klassenraum"},{"$f":"A2","v":"2020-21 05a Klassenraum"},{"$f":"IF(A19=\"\",\"\",IF(Vorgaben!$B$3=\"\",\"\",Vorgaben!$B$3&\" / \")&IF(Vorgaben!$D$3=\"\",\"\",Vorgaben!$D$3&\" / \")&IF(Vorgaben!$F$3=\"\",\"\",IF(Vorgaben!$B$6=\"\",Vorgaben!$F$3&\" / \",Vorgaben!$F$3&\" (\"&Vorgaben!$B$6&\") / \"))&IF(Vorgaben!$H$3=\"\",\"\",IF(Vorgaben!$B$6=\"\",Vorgaben!$H$3&\" / \",Vorgaben!$H$3&\" (\"&Vorgaben!$B$6&\") / \"))&IF(Vorgaben!$D$6=\"\",\"\",IF(Vorgaben!$B$6=\"\",Vorgaben!$D$6,Vorgaben!$D$6&\" (\"&Vorgaben!$B$6&\")\")))","v":"Unterricht / 2020-21 / Stufe 05 (2020-21) / 05a (2020-21)"},{"$f":"IF(OR($A2=\"\",Vorgaben!$H6=\"\"),\"\",Vorgaben!$H6)","v":"VorlageKlasse"},{"$f":"IF(OR($A2=\"\",Vorgaben!$I$7=\"\"),\"\",\"self\")","v":"self"},{"$f":"IF(OR($A2=\"\",Vorgaben!$I$7=\"\"),\"\",\"editingteacher\")","v":"editingteacher"},{"$f":"IF(OR($A2=\"\",Vorgaben!$I$7=\"\"),\"\",Vorgaben!$I$7)","v":"djv5456+"},{"$f":"IF(OR($A2=\"\",Vorgaben!$I$14=\"\"),\"\",\"self\")","v":""},{"$f":"IF(OR($A2=\"\",Vorgaben!$I$14=\"\"),\"\",\"student\")","v":""},{"$f":"IF(OR($A2=\"\",Vorgaben!$I$14=\"\"),\"\",Vorgaben!$I$14)","v":""}]
[{"$f":"IF(OR(Vorgaben!$D$6=\"\",Vorgaben!$G7=\"\"),\"\",IF(Vorgaben!$B$6=\"\",Vorgaben!$D$6&\" \"&Vorgaben!$G7,Vorgaben!$B$6&\" \"&Vorgaben!$D$6&\" \"&Vorgaben!$G7))","v":"2020-21 05a Deutsch"},{"$f":"A3","v":"2020-21 05a Deutsch"},{"$f":"IF(A20=\"\",\"\",IF(Vorgaben!$B$3=\"\",\"\",Vorgaben!$B$3&\" / \")&IF(Vorgaben!$D$3=\"\",\"\",Vorgaben!$D$3&\" / \")&IF(Vorgaben!$F$3=\"\",\"\",IF(Vorgaben!$B$6=\"\",Vorgaben!$F$3&\" / \",Vorgaben!$F$3&\" (\"&Vorgaben!$B$6&\") / \"))&IF(Vorgaben!$H$3=\"\",\"\",IF(Vorgaben!$B$6=\"\",Vorgaben!$H$3&\" / \",Vorgaben!$H$3&\" (\"&Vorgaben!$B$6&\") / \"))&IF(Vorgaben!$D$6=\"\",\"\",IF(Vorgaben!$B$6=\"\",Vorgaben!$D$6,Vorgaben!$D$6&\" (\"&Vorgaben!$B$6&\")\")))","v":"Unterricht / 2020-21 / Stufe 05 (2020-21) / 05a (2020-21)"},{"$f":"IF(OR($A3=\"\",Vorgaben!$H7=\"\"),\"\",Vorgaben!$H7)","v":"VorlageFach"},{"$f":"IF(OR($A3=\"\",Vorgaben!$I$7=\"\"),\"\",$E$2)","v":"self"},{"$f":"IF(OR($A3=\"\",Vorgaben!$I$7=\"\"),\"\",\"editingteacher\")","v":"editingteacher"},{"$f":"IF(OR($A3=\"\",Vorgaben!$I$7=\"\"),\"\",Vorgaben!$I$7)","v":"djv5456+"},{"$f":"IF(OR($A3=\"\",Vorgaben!$I$14=\"\"),\"\",\"self\")","v":""},{"$f":"IF(OR($A3=\"\",Vorgaben!$I$14=\"\"),\"\",\"student\")","v":""},{"$f":"IF(OR($A3=\"\",Vorgaben!$I$14=\"\"),\"\",Vorgaben!$I$14)","v":""}]
[{"$f":"IF(OR(Vorgaben!$D$6=\"\",Vorgaben!$G8=\"\"),\"\",IF(Vorgaben!$B$6=\"\",Vorgaben!$D$6&\" \"&Vorgaben!$G8,Vorgaben!$B$6&\" \"&Vorgaben!$D$6&\" \"&Vorgaben!$G8))","v":"2020-21 05a Englisch"},"2020-21 05a Englisch",{"$f":"IF(A21=\"\",\"\",IF(Vorgaben!$B$3=\"\",\"\",Vorgaben!$B$3&\" / \")&IF(Vorgaben!$D$3=\"\",\"\",Vorgaben!$D$3&\" / \")&IF(Vorgaben!$F$3=\"\",\"\",IF(Vorgaben!$B$6=\"\",Vorgaben!$F$3&\" / \",Vorgaben!$F$3&\" (\"&Vorgaben!$B$6&\") / \"))&IF(Vorgaben!$H$3=\"\",\"\",IF(Vorgaben!$B$6=\"\",Vorgaben!$H$3&\" / \",Vorgaben!$H$3&\" (\"&Vorgaben!$B$6&\") / \"))&IF(Vorgaben!$D$6=\"\",\"\",IF(Vorgaben!$B$6=\"\",Vorgaben!$D$6,Vorgaben!$D$6&\" (\"&Vorgaben!$B$6&\")\")))","v":"Unterricht / 2020-21 / Stufe 05 (2020-21) / 05a (2020-21)"},{"$f":"IF(OR($A4=\"\",Vorgaben!$H8=\"\"),\"\",Vorgaben!$H8)","v":"VorlageEnglisch"},{"$f":"IF(OR($A4=\"\",Vorgaben!$I$7=\"\"),\"\",$E$2)","v":"self"},{"$f":"IF(OR($A4=\"\",Vorgaben!$I$7=\"\"),\"\",\"editingteacher\")","v":"editingteacher"},{"$f":"IF(OR($A4=\"\",Vorgaben!$I$7=\"\"),\"\",Vorgaben!$I$7)","v":"djv5456+"},{"$f":"IF(OR($A4=\"\",Vorgaben!$I$14=\"\"),\"\",\"self\")","v":""},{"$f":"IF(OR($A4=\"\",Vorgaben!$I$14=\"\"),\"\",\"student\")","v":""},{"$f":"IF(OR($A4=\"\",Vorgaben!$I$14=\"\"),\"\",Vorgaben!$I$14)","v":""}]
[{"$f":"IF(OR(Vorgaben!$D$6=\"\",Vorgaben!$G9=\"\"),\"\",IF(Vorgaben!$B$6=\"\",Vorgaben!$D$6&\" \"&Vorgaben!$G9,Vorgaben!$B$6&\" \"&Vorgaben!$D$6&\" \"&Vorgaben!$G9))","v":"2020-21 05a Mathematik"},"2020-21 05a Mathematik",{"$f":"IF(A22=\"\",\"\",IF(Vorgaben!$B$3=\"\",\"\",Vorgaben!$B$3&\" / \")&IF(Vorgaben!$D$3=\"\",\"\",Vorgaben!$D$3&\" / \")&IF(Vorgaben!$F$3=\"\",\"\",IF(Vorgaben!$B$6=\"\",Vorgaben!$F$3&\" / \",Vorgaben!$F$3&\" (\"&Vorgaben!$B$6&\") / \"))&IF(Vorgaben!$H$3=\"\",\"\",IF(Vorgaben!$B$6=\"\",Vorgaben!$H$3&\" / \",Vorgaben!$H$3&\" (\"&Vorgaben!$B$6&\") / \"))&IF(Vorgaben!$D$6=\"\",\"\",IF(Vorgaben!$B$6=\"\",Vorgaben!$D$6,Vorgaben!$D$6&\" (\"&Vorgaben!$B$6&\")\")))","v":"Unterricht / 2020-21 / Stufe 05 (2020-21) / 05a (2020-21)"},{"$f":"IF(OR($A5=\"\",Vorgaben!$H9=\"\"),\"\",Vorgaben!$H9)","v":"VorlageFach"},{"$f":"IF(OR($A5=\"\",Vorgaben!$I$7=\"\"),\"\",$E$2)","v":"self"},{"$f":"IF(OR($A5=\"\",Vorgaben!$I$7=\"\"),\"\",\"editingteacher\")","v":"editingteacher"},{"$f":"IF(OR($A5=\"\",Vorgaben!$I$7=\"\"),\"\",Vorgaben!$I$7)","v":"djv5456+"},{"$f":"IF(OR($A5=\"\",Vorgaben!$I$14=\"\"),\"\",\"self\")","v":""},{"$f":"IF(OR($A5=\"\",Vorgaben!$I$14=\"\"),\"\",\"student\")","v":""},{"$f":"IF(OR($A5=\"\",Vorgaben!$I$14=\"\"),\"\",Vorgaben!$I$14)","v":""}]
[{"$f":"IF(OR(Vorgaben!$D$6=\"\",Vorgaben!$G10=\"\"),\"\",IF(Vorgaben!$B$6=\"\",Vorgaben!$D$6&\" \"&Vorgaben!$G10,Vorgaben!$B$6&\" \"&Vorgaben!$D$6&\" \"&Vorgaben!$G10))","v":"2020-21 05a Biologie"},"2020-21 05a Biologie",{"$f":"IF(A23=\"\",\"\",IF(Vorgaben!$B$3=\"\",\"\",Vorgaben!$B$3&\" / \")&IF(Vorgaben!$D$3=\"\",\"\",Vorgaben!$D$3&\" / \")&IF(Vorgaben!$F$3=\"\",\"\",IF(Vorgaben!$B$6=\"\",Vorgaben!$F$3&\" / \",Vorgaben!$F$3&\" (\"&Vorgaben!$B$6&\") / \"))&IF(Vorgaben!$H$3=\"\",\"\",IF(Vorgaben!$B$6=\"\",Vorgaben!$H$3&\" / \",Vorgaben!$H$3&\" (\"&Vorgaben!$B$6&\") / \"))&IF(Vorgaben!$D$6=\"\",\"\",IF(Vorgaben!$B$6=\"\",Vorgaben!$D$6,Vorgaben!$D$6&\" (\"&Vorgaben!$B$6&\")\")))","v":"Unterricht / 2020-21 / Stufe 05 (2020-21) / 05a (2020-21)"},{"$f":"IF(OR($A6=\"\",Vorgaben!$H10=\"\"),\"\",Vorgaben!$H10)","v":"VorlageFach"},{"$f":"IF(OR($A6=\"\",Vorgaben!$I$7=\"\"),\"\",$E$2)","v":"self"},{"$f":"IF(OR($A6=\"\",Vorgaben!$I$7=\"\"),\"\",\"editingteacher\")","v":"editingteacher"},{"$f":"IF(OR($A6=\"\",Vorgaben!$I$7=\"\"),\"\",Vorgaben!$I$7)","v":"djv5456+"},{"$f":"IF(OR($A6=\"\",Vorgaben!$I$14=\"\"),\"\",\"self\")","v":""},{"$f":"IF(OR($A6=\"\",Vorgaben!$I$14=\"\"),\"\",\"student\")","v":""},{"$f":"IF(OR($A6=\"\",Vorgaben!$I$14=\"\"),\"\",Vorgaben!$I$14)","v":""}]
[{"$f":"IF(OR(Vorgaben!$D$6=\"\",Vorgaben!$G11=\"\"),\"\",IF(Vorgaben!$B$6=\"\",Vorgaben!$D$6&\" \"&Vorgaben!$G11,Vorgaben!$B$6&\" \"&Vorgaben!$D$6&\" \"&Vorgaben!$G11))","v":"2020-21 05a Physik"},"2020-21 05a Physik",{"$f":"IF(A24=\"\",\"\",IF(Vorgaben!$B$3=\"\",\"\",Vorgaben!$B$3&\" / \")&IF(Vorgaben!$D$3=\"\",\"\",Vorgaben!$D$3&\" / \")&IF(Vorgaben!$F$3=\"\",\"\",IF(Vorgaben!$B$6=\"\",Vorgaben!$F$3&\" / \",Vorgaben!$F$3&\" (\"&Vorgaben!$B$6&\") / \"))&IF(Vorgaben!$H$3=\"\",\"\",IF(Vorgaben!$B$6=\"\",Vorgaben!$H$3&\" / \",Vorgaben!$H$3&\" (\"&Vorgaben!$B$6&\") / \"))&IF(Vorgaben!$D$6=\"\",\"\",IF(Vorgaben!$B$6=\"\",Vorgaben!$D$6,Vorgaben!$D$6&\" (\"&Vorgaben!$B$6&\")\")))","v":"Unterricht / 2020-21 / Stufe 05 (2020-21) / 05a (2020-21)"},{"$f":"IF(OR($A7=\"\",Vorgaben!$H11=\"\"),\"\",Vorgaben!$H11)","v":"VorlageFach"},{"$f":"IF(OR($A7=\"\",Vorgaben!$I$7=\"\"),\"\",$E$2)","v":"self"},{"$f":"IF(OR($A7=\"\",Vorgaben!$I$7=\"\"),\"\",\"editingteacher\")","v":"editingteacher"},{"$f":"IF(OR($A7=\"\",Vorgaben!$I$7=\"\"),\"\",Vorgaben!$I$7)","v":"djv5456+"},{"$f":"IF(OR($A7=\"\",Vorgaben!$I$14=\"\"),\"\",\"self\")","v":""},{"$f":"IF(OR($A7=\"\",Vorgaben!$I$14=\"\"),\"\",\"student\")","v":""},{"$f":"IF(OR($A7=\"\",Vorgaben!$I$14=\"\"),\"\",Vorgaben!$I$14)","v":""}]
[{"$f":"IF(OR(Vorgaben!$D$6=\"\",Vorgaben!$G12=\"\"),\"\",IF(Vorgaben!$B$6=\"\",Vorgaben!$D$6&\" \"&Vorgaben!$G12,Vorgaben!$B$6&\" \"&Vorgaben!$D$6&\" \"&Vorgaben!$G12))","v":"2020-21 05a Sport"},"2020-21 05a Sport",{"$f":"IF(A25=\"\",\"\",IF(Vorgaben!$B$3=\"\",\"\",Vorgaben!$B$3&\" / \")&IF(Vorgaben!$D$3=\"\",\"\",Vorgaben!$D$3&\" / \")&IF(Vorgaben!$F$3=\"\",\"\",IF(Vorgaben!$B$6=\"\",Vorgaben!$F$3&\" / \",Vorgaben!$F$3&\" (\"&Vorgaben!$B$6&\") / \"))&IF(Vorgaben!$H$3=\"\",\"\",IF(Vorgaben!$B$6=\"\",Vorgaben!$H$3&\" / \",Vorgaben!$H$3&\" (\"&Vorgaben!$B$6&\") / \"))&IF(Vorgaben!$D$6=\"\",\"\",IF(Vorgaben!$B$6=\"\",Vorgaben!$D$6,Vorgaben!$D$6&\" (\"&Vorgaben!$B$6&\")\")))","v":"Unterricht / 2020-21 / Stufe 05 (2020-21) / 05a (2020-21)"},{"$f":"IF(OR($A8=\"\",Vorgaben!$H12=\"\"),\"\",Vorgaben!$H12)","v":"VorlageFach"},{"$f":"IF(OR($A8=\"\",Vorgaben!$I$7=\"\"),\"\",$E$2)","v":"self"},{"$f":"IF(OR($A8=\"\",Vorgaben!$I$7=\"\"),\"\",\"editingteacher\")","v":"editingteacher"},{"$f":"IF(OR($A8=\"\",Vorgaben!$I$7=\"\"),\"\",Vorgaben!$I$7)","v":"djv5456+"},{"$f":"IF(OR($A8=\"\",Vorgaben!$I$14=\"\"),\"\",\"self\")","v":""},{"$f":"IF(OR($A8=\"\",Vorgaben!$I$14=\"\"),\"\",\"student\")","v":""},{"$f":"IF(OR($A8=\"\",Vorgaben!$I$14=\"\"),\"\",Vorgaben!$I$14)","v":""}]
[{"$f":"IF(OR(Vorgaben!$D$6=\"\",Vorgaben!$G13=\"\"),\"\",IF(Vorgaben!$B$6=\"\",Vorgaben!$D$6&\" \"&Vorgaben!$G13,Vorgaben!$B$6&\" \"&Vorgaben!$D$6&\" \"&Vorgaben!$G13))","v":""},"",{"$f":"IF(A26=\"\",\"\",IF(Vorgaben!$B$3=\"\",\"\",Vorgaben!$B$3&\" / \")&IF(Vorgaben!$D$3=\"\",\"\",Vorgaben!$D$3&\" / \")&IF(Vorgaben!$F$3=\"\",\"\",IF(Vorgaben!$B$6=\"\",Vorgaben!$F$3&\" / \",Vorgaben!$F$3&\" (\"&Vorgaben!$B$6&\") / \"))&IF(Vorgaben!$H$3=\"\",\"\",IF(Vorgaben!$B$6=\"\",Vorgaben!$H$3&\" / \",Vorgaben!$H$3&\" (\"&Vorgaben!$B$6&\") / \"))&IF(Vorgaben!$D$6=\"\",\"\",IF(Vorgaben!$B$6=\"\",Vorgaben!$D$6,Vorgaben!$D$6&\" (\"&Vorgaben!$B$6&\")\")))","v":""},{"$f":"IF(OR($A9=\"\",Vorgaben!$H13=\"\"),\"\",Vorgaben!$H13)","v":""},{"$f":"IF(OR($A9=\"\",Vorgaben!$I$7=\"\"),\"\",$E$2)","v":""},{"$f":"IF(OR($A9=\"\",Vorgaben!$I$7=\"\"),\"\",\"editingteacher\")","v":""},{"$f":"IF(OR($A9=\"\",Vorgaben!$I$7=\"\"),\"\",Vorgaben!$I$7)","v":""},{"$f":"IF(OR($A9=\"\",Vorgaben!$I$14=\"\"),\"\",\"self\")","v":""},{"$f":"IF(OR($A9=\"\",Vorgaben!$I$14=\"\"),\"\",\"student\")","v":""},{"$f":"IF(OR($A9=\"\",Vorgaben!$I$14=\"\"),\"\",Vorgaben!$I$14)","v":""}]
[{"$f":"IF(OR(Vorgaben!$D$6=\"\",Vorgaben!$G14=\"\"),\"\",IF(Vorgaben!$B$6=\"\",Vorgaben!$D$6&\" \"&Vorgaben!$G14,Vorgaben!$B$6&\" \"&Vorgaben!$D$6&\" \"&Vorgaben!$G14))","v":""},"",{"$f":"IF(A27=\"\",\"\",IF(Vorgaben!$B$3=\"\",\"\",Vorgaben!$B$3&\" / \")&IF(Vorgaben!$D$3=\"\",\"\",Vorgaben!$D$3&\" / \")&IF(Vorgaben!$F$3=\"\",\"\",IF(Vorgaben!$B$6=\"\",Vorgaben!$F$3&\" / \",Vorgaben!$F$3&\" (\"&Vorgaben!$B$6&\") / \"))&IF(Vorgaben!$H$3=\"\",\"\",IF(Vorgaben!$B$6=\"\",Vorgaben!$H$3&\" / \",Vorgaben!$H$3&\" (\"&Vorgaben!$B$6&\") / \"))&IF(Vorgaben!$D$6=\"\",\"\",IF(Vorgaben!$B$6=\"\",Vorgaben!$D$6,Vorgaben!$D$6&\" (\"&Vorgaben!$B$6&\")\")))","v":""},{"$f":"IF(OR($A10=\"\",Vorgaben!$H14=\"\"),\"\",Vorgaben!$H14)","v":""},{"$f":"IF(OR($A10=\"\",Vorgaben!$I$7=\"\"),\"\",$E$2)","v":""},{"$f":"IF(OR($A10=\"\",Vorgaben!$I$7=\"\"),\"\",\"editingteacher\")","v":""},{"$f":"IF(OR($A10=\"\",Vorgaben!$I$7=\"\"),\"\",Vorgaben!$I$7)","v":""},{"$f":"IF(OR($A10=\"\",Vorgaben!$I$14=\"\"),\"\",\"self\")","v":""},{"$f":"IF(OR($A10=\"\",Vorgaben!$I$14=\"\"),\"\",\"student\")","v":""},{"$f":"IF(OR($A10=\"\",Vorgaben!$I$14=\"\"),\"\",Vorgaben!$I$14)","v":""}]
[{"$f":"IF(OR(Vorgaben!$D$6=\"\",Vorgaben!$G15=\"\"),\"\",IF(Vorgaben!$B$6=\"\",Vorgaben!$D$6&\" \"&Vorgaben!$G15,Vorgaben!$B$6&\" \"&Vorgaben!$D$6&\" \"&Vorgaben!$G15))","v":""},"",{"$f":"IF(A28=\"\",\"\",IF(Vorgaben!$B$3=\"\",\"\",Vorgaben!$B$3&\" / \")&IF(Vorgaben!$D$3=\"\",\"\",Vorgaben!$D$3&\" / \")&IF(Vorgaben!$F$3=\"\",\"\",IF(Vorgaben!$B$6=\"\",Vorgaben!$F$3&\" / \",Vorgaben!$F$3&\" (\"&Vorgaben!$B$6&\") / \"))&IF(Vorgaben!$H$3=\"\",\"\",IF(Vorgaben!$B$6=\"\",Vorgaben!$H$3&\" / \",Vorgaben!$H$3&\" (\"&Vorgaben!$B$6&\") / \"))&IF(Vorgaben!$D$6=\"\",\"\",IF(Vorgaben!$B$6=\"\",Vorgaben!$D$6,Vorgaben!$D$6&\" (\"&Vorgaben!$B$6&\")\")))","v":""},{"$f":"IF(OR($A11=\"\",Vorgaben!$H15=\"\"),\"\",Vorgaben!$H15)","v":""},{"$f":"IF(OR($A11=\"\",Vorgaben!$I$7=\"\"),\"\",$E$2)","v":""},{"$f":"IF(OR($A11=\"\",Vorgaben!$I$7=\"\"),\"\",\"editingteacher\")","v":""},{"$f":"IF(OR($A11=\"\",Vorgaben!$I$7=\"\"),\"\",Vorgaben!$I$7)","v":""},{"$f":"IF(OR($A11=\"\",Vorgaben!$I$14=\"\"),\"\",\"self\")","v":""},{"$f":"IF(OR($A11=\"\",Vorgaben!$I$14=\"\"),\"\",\"student\")","v":""},{"$f":"IF(OR($A11=\"\",Vorgaben!$I$14=\"\"),\"\",Vorgaben!$I$14)","v":""}]
[{"$f":"IF(OR(Vorgaben!$D$6=\"\",Vorgaben!$G16=\"\"),\"\",IF(Vorgaben!$B$6=\"\",Vorgaben!$D$6&\" \"&Vorgaben!$G16,Vorgaben!$B$6&\" \"&Vorgaben!$D$6&\" \"&Vorgaben!$G16))","v":""},"",{"$f":"IF(A29=\"\",\"\",IF(Vorgaben!$B$3=\"\",\"\",Vorgaben!$B$3&\" / \")&IF(Vorgaben!$D$3=\"\",\"\",Vorgaben!$D$3&\" / \")&IF(Vorgaben!$F$3=\"\",\"\",IF(Vorgaben!$B$6=\"\",Vorgaben!$F$3&\" / \",Vorgaben!$F$3&\" (\"&Vorgaben!$B$6&\") / \"))&IF(Vorgaben!$H$3=\"\",\"\",IF(Vorgaben!$B$6=\"\",Vorgaben!$H$3&\" / \",Vorgaben!$H$3&\" (\"&Vorgaben!$B$6&\") / \"))&IF(Vorgaben!$D$6=\"\",\"\",IF(Vorgaben!$B$6=\"\",Vorgaben!$D$6,Vorgaben!$D$6&\" (\"&Vorgaben!$B$6&\")\")))","v":""},{"$f":"IF(OR($A12=\"\",Vorgaben!$H16=\"\"),\"\",Vorgaben!$H16)","v":""},{"$f":"IF(OR($A12=\"\",Vorgaben!$I$7=\"\"),\"\",$E$2)","v":""},{"$f":"IF(OR($A12=\"\",Vorgaben!$I$7=\"\"),\"\",\"editingteacher\")","v":""},{"$f":"IF(OR($A12=\"\",Vorgaben!$I$7=\"\"),\"\",Vorgaben!$I$7)","v":""},{"$f":"IF(OR($A12=\"\",Vorgaben!$I$14=\"\"),\"\",\"self\")","v":""},{"$f":"IF(OR($A12=\"\",Vorgaben!$I$14=\"\"),\"\",\"student\")","v":""},{"$f":"IF(OR($A12=\"\",Vorgaben!$I$14=\"\"),\"\",Vorgaben!$I$14)","v":""}]
[{"$f":"IF(OR(Vorgaben!$D$6=\"\",Vorgaben!$G17=\"\"),\"\",IF(Vorgaben!$B$6=\"\",Vorgaben!$D$6&\" \"&Vorgaben!$G17,Vorgaben!$B$6&\" \"&Vorgaben!$D$6&\" \"&Vorgaben!$G17))","v":""},"",{"$f":"IF(A30=\"\",\"\",IF(Vorgaben!$B$3=\"\",\"\",Vorgaben!$B$3&\" / \")&IF(Vorgaben!$D$3=\"\",\"\",Vorgaben!$D$3&\" / \")&IF(Vorgaben!$F$3=\"\",\"\",IF(Vorgaben!$B$6=\"\",Vorgaben!$F$3&\" / \",Vorgaben!$F$3&\" (\"&Vorgaben!$B$6&\") / \"))&IF(Vorgaben!$H$3=\"\",\"\",IF(Vorgaben!$B$6=\"\",Vorgaben!$H$3&\" / \",Vorgaben!$H$3&\" (\"&Vorgaben!$B$6&\") / \"))&IF(Vorgaben!$D$6=\"\",\"\",IF(Vorgaben!$B$6=\"\",Vorgaben!$D$6,Vorgaben!$D$6&\" (\"&Vorgaben!$B$6&\")\")))","v":""},{"$f":"IF(OR($A13=\"\",Vorgaben!$H17=\"\"),\"\",Vorgaben!$H17)","v":""},{"$f":"IF(OR($A13=\"\",Vorgaben!$I$7=\"\"),\"\",$E$2)","v":""},{"$f":"IF(OR($A13=\"\",Vorgaben!$I$7=\"\"),\"\",\"editingteacher\")","v":""},{"$f":"IF(OR($A13=\"\",Vorgaben!$I$7=\"\"),\"\",Vorgaben!$I$7)","v":""},{"$f":"IF(OR($A13=\"\",Vorgaben!$I$14=\"\"),\"\",\"self\")","v":""},{"$f":"IF(OR($A13=\"\",Vorgaben!$I$14=\"\"),\"\",\"student\")","v":""},{"$f":"IF(OR($A13=\"\",Vorgaben!$I$14=\"\"),\"\",Vorgaben!$I$14)","v":""}]
[{"$f":"IF(OR(Vorgaben!$D$6=\"\",Vorgaben!$G18=\"\"),\"\",IF(Vorgaben!$B$6=\"\",Vorgaben!$D$6&\" \"&Vorgaben!$G18,Vorgaben!$B$6&\" \"&Vorgaben!$D$6&\" \"&Vorgaben!$G18))","v":""},"",{"$f":"IF(A31=\"\",\"\",IF(Vorgaben!$B$3=\"\",\"\",Vorgaben!$B$3&\" / \")&IF(Vorgaben!$D$3=\"\",\"\",Vorgaben!$D$3&\" / \")&IF(Vorgaben!$F$3=\"\",\"\",IF(Vorgaben!$B$6=\"\",Vorgaben!$F$3&\" / \",Vorgaben!$F$3&\" (\"&Vorgaben!$B$6&\") / \"))&IF(Vorgaben!$H$3=\"\",\"\",IF(Vorgaben!$B$6=\"\",Vorgaben!$H$3&\" / \",Vorgaben!$H$3&\" (\"&Vorgaben!$B$6&\") / \"))&IF(Vorgaben!$D$6=\"\",\"\",IF(Vorgaben!$B$6=\"\",Vorgaben!$D$6,Vorgaben!$D$6&\" (\"&Vorgaben!$B$6&\")\")))","v":""},{"$f":"IF(OR($A14=\"\",Vorgaben!$H18=\"\"),\"\",Vorgaben!$H18)","v":""},{"$f":"IF(OR($A14=\"\",Vorgaben!$I$7=\"\"),\"\",$E$2)","v":""},{"$f":"IF(OR($A14=\"\",Vorgaben!$I$7=\"\"),\"\",\"editingteacher\")","v":""},{"$f":"IF(OR($A14=\"\",Vorgaben!$I$7=\"\"),\"\",Vorgaben!$I$7)","v":""},{"$f":"IF(OR($A14=\"\",Vorgaben!$I$14=\"\"),\"\",\"self\")","v":""},{"$f":"IF(OR($A14=\"\",Vorgaben!$I$14=\"\"),\"\",\"student\")","v":""},{"$f":"IF(OR($A14=\"\",Vorgaben!$I$14=\"\"),\"\",Vorgaben!$I$14)","v":""}]
[{"$f":"IF(OR(Vorgaben!$D$6=\"\",Vorgaben!$G19=\"\"),\"\",IF(Vorgaben!$B$6=\"\",Vorgaben!$D$6&\" \"&Vorgaben!$G19,Vorgaben!$B$6&\" \"&Vorgaben!$D$6&\" \"&Vorgaben!$G19))","v":""},"",{"$f":"IF(A32=\"\",\"\",IF(Vorgaben!$B$3=\"\",\"\",Vorgaben!$B$3&\" / \")&IF(Vorgaben!$D$3=\"\",\"\",Vorgaben!$D$3&\" / \")&IF(Vorgaben!$F$3=\"\",\"\",IF(Vorgaben!$B$6=\"\",Vorgaben!$F$3&\" / \",Vorgaben!$F$3&\" (\"&Vorgaben!$B$6&\") / \"))&IF(Vorgaben!$H$3=\"\",\"\",IF(Vorgaben!$B$6=\"\",Vorgaben!$H$3&\" / \",Vorgaben!$H$3&\" (\"&Vorgaben!$B$6&\") / \"))&IF(Vorgaben!$D$6=\"\",\"\",IF(Vorgaben!$B$6=\"\",Vorgaben!$D$6,Vorgaben!$D$6&\" (\"&Vorgaben!$B$6&\")\")))","v":""},{"$f":"IF(OR($A15=\"\",Vorgaben!$H19=\"\"),\"\",Vorgaben!$H19)","v":""},{"$f":"IF(OR($A15=\"\",Vorgaben!$I$7=\"\"),\"\",$E$2)","v":""},{"$f":"IF(OR($A15=\"\",Vorgaben!$I$7=\"\"),\"\",\"editingteacher\")","v":""},{"$f":"IF(OR($A15=\"\",Vorgaben!$I$7=\"\"),\"\",Vorgaben!$I$7)","v":""},{"$f":"IF(OR($A15=\"\",Vorgaben!$I$14=\"\"),\"\",\"self\")","v":""},{"$f":"IF(OR($A15=\"\",Vorgaben!$I$14=\"\"),\"\",\"student\")","v":""},{"$f":"IF(OR($A15=\"\",Vorgaben!$I$14=\"\"),\"\",Vorgaben!$I$14)","v":""}]
[{"$f":"IF(OR(Vorgaben!$D$6=\"\",Vorgaben!$G20=\"\"),\"\",IF(Vorgaben!$B$6=\"\",Vorgaben!$D$6&\" \"&Vorgaben!$G20,Vorgaben!$B$6&\" \"&Vorgaben!$D$6&\" \"&Vorgaben!$G20))","v":""},"",{"$f":"IF(A33=\"\",\"\",IF(Vorgaben!$B$3=\"\",\"\",Vorgaben!$B$3&\" / \")&IF(Vorgaben!$D$3=\"\",\"\",Vorgaben!$D$3&\" / \")&IF(Vorgaben!$F$3=\"\",\"\",IF(Vorgaben!$B$6=\"\",Vorgaben!$F$3&\" / \",Vorgaben!$F$3&\" (\"&Vorgaben!$B$6&\") / \"))&IF(Vorgaben!$H$3=\"\",\"\",IF(Vorgaben!$B$6=\"\",Vorgaben!$H$3&\" / \",Vorgaben!$H$3&\" (\"&Vorgaben!$B$6&\") / \"))&IF(Vorgaben!$D$6=\"\",\"\",IF(Vorgaben!$B$6=\"\",Vorgaben!$D$6,Vorgaben!$D$6&\" (\"&Vorgaben!$B$6&\")\")))","v":""},{"$f":"IF(OR($A16=\"\",Vorgaben!$H20=\"\"),\"\",Vorgaben!$H20)","v":""},{"$f":"IF(OR($A16=\"\",Vorgaben!$I$7=\"\"),\"\",$E$2)","v":""},{"$f":"IF(OR($A16=\"\",Vorgaben!$I$7=\"\"),\"\",\"editingteacher\")","v":""},{"$f":"IF(OR($A16=\"\",Vorgaben!$I$7=\"\"),\"\",Vorgaben!$I$7)","v":""},{"$f":"IF(OR($A16=\"\",Vorgaben!$I$14=\"\"),\"\",\"self\")","v":""},{"$f":"IF(OR($A16=\"\",Vorgaben!$I$14=\"\"),\"\",\"student\")","v":""},{"$f":"IF(OR($A16=\"\",Vorgaben!$I$14=\"\"),\"\",Vorgaben!$I$14)","v":""}]
[{"$f":"IF(OR(Vorgaben!$D$6=\"\",Vorgaben!$G21=\"\"),\"\",IF(Vorgaben!$B$6=\"\",Vorgaben!$D$6&\" \"&Vorgaben!$G21,Vorgaben!$B$6&\" \"&Vorgaben!$D$6&\" \"&Vorgaben!$G21))","v":""},"",{"$f":"IF(A34=\"\",\"\",IF(Vorgaben!$B$3=\"\",\"\",Vorgaben!$B$3&\" / \")&IF(Vorgaben!$D$3=\"\",\"\",Vorgaben!$D$3&\" / \")&IF(Vorgaben!$F$3=\"\",\"\",IF(Vorgaben!$B$6=\"\",Vorgaben!$F$3&\" / \",Vorgaben!$F$3&\" (\"&Vorgaben!$B$6&\") / \"))&IF(Vorgaben!$H$3=\"\",\"\",IF(Vorgaben!$B$6=\"\",Vorgaben!$H$3&\" / \",Vorgaben!$H$3&\" (\"&Vorgaben!$B$6&\") / \"))&IF(Vorgaben!$D$6=\"\",\"\",IF(Vorgaben!$B$6=\"\",Vorgaben!$D$6,Vorgaben!$D$6&\" (\"&Vorgaben!$B$6&\")\")))","v":""},{"$f":"IF(OR($A17=\"\",Vorgaben!$H21=\"\"),\"\",Vorgaben!$H21)","v":""},{"$f":"IF(OR($A17=\"\",Vorgaben!$I$7=\"\"),\"\",$E$2)","v":""},{"$f":"IF(OR($A17=\"\",Vorgaben!$I$7=\"\"),\"\",\"editingteacher\")","v":""},{"$f":"IF(OR($A17=\"\",Vorgaben!$I$7=\"\"),\"\",Vorgaben!$I$7)","v":""},{"$f":"IF(OR($A17=\"\",Vorgaben!$I$14=\"\"),\"\",\"self\")","v":""},{"$f":"IF(OR($A17=\"\",Vorgaben!$I$14=\"\"),\"\",\"student\")","v":""},{"$f":"IF(OR($A17=\"\",Vorgaben!$I$14=\"\"),\"\",Vorgaben!$I$14)","v":""}]
[]
[{"$f":"IF(OR(Vorgaben!$D$7=\"\",Vorgaben!$G6=\"\"),\"\",IF(Vorgaben!$B$6=\"\",Vorgaben!$D$7&\" \"&Vorgaben!$G6,Vorgaben!$B$6&\" \"&Vorgaben!$D$7&\" \"&Vorgaben!$G6))","v":"2020-21 05b Klassenraum"},{"$f":"IF(OR(Vorgaben!$D$7=\"\",Vorgaben!$G6=\"\"),\"\",Vorgaben!$B$6&\" \"&Vorgaben!$D$7&\" \"&Vorgaben!$G6)","v":"2020-21 05b Klassenraum"},{"$f":"IF(A19=\"\",\"\",IF(Vorgaben!$B$3=\"\",\"\",Vorgaben!$B$3&\" / \")&IF(Vorgaben!$D$3=\"\",\"\",Vorgaben!$D$3&\" / \")&IF(Vorgaben!$F$3=\"\",\"\",IF(Vorgaben!$B$6=\"\",Vorgaben!$F$3&\" / \",Vorgaben!$F$3&\" (\"&Vorgaben!$B$6&\") / \"))&IF(Vorgaben!$H$3=\"\",\"\",IF(Vorgaben!$B$6=\"\",Vorgaben!$H$3&\" / \",Vorgaben!$H$3&\" (\"&Vorgaben!$B$6&\") / \"))&IF(Vorgaben!$D$7=\"\",\"\",IF(Vorgaben!$B$6=\"\",Vorgaben!$D$7,Vorgaben!$D$7&\" (\"&Vorgaben!$B$6&\")\")))","v":"Unterricht / 2020-21 / Stufe 05 (2020-21) / 05b (2020-21)"},{"$f":"IF(OR($A19=\"\",Vorgaben!$H6=\"\"),\"\",Vorgaben!$H6)","v":"VorlageKlasse"},{"$f":"IF(OR($A19=\"\",Vorgaben!$I$7=\"\"),\"\",$E$2)","v":"self"},{"$f":"IF(OR($A19=\"\",Vorgaben!$I$7=\"\"),\"\",\"editingteacher\")","v":"editingteacher"},{"$f":"IF(OR($A19=\"\",Vorgaben!$I$7=\"\"),\"\",Vorgaben!$I$7)","v":"djv5456+"},{"$f":"IF(OR($A19=\"\",Vorgaben!$I$14=\"\"),\"\",\"self\")","v":""},{"$f":"IF(OR($A19=\"\",Vorgaben!$I$14=\"\"),\"\",\"student\")","v":""},{"$f":"IF(OR($A19=\"\",Vorgaben!$I$14=\"\"),\"\",Vorgaben!$I$14)","v":""}]
[{"$f":"IF(OR(Vorgaben!$D$7=\"\",Vorgaben!$G7=\"\"),\"\",IF(Vorgaben!$B$6=\"\",Vorgaben!$D$7&\" \"&Vorgaben!$G7,Vorgaben!$B$6&\" \"&Vorgaben!$D$7&\" \"&Vorgaben!$G7))","v":"2020-21 05b Deutsch"},{"$f":"IF(OR(Vorgaben!$D$7=\"\",Vorgaben!$G7=\"\"),\"\",Vorgaben!$B$6&\" \"&Vorgaben!$D$7&\" \"&Vorgaben!$G7)","v":"2020-21 05b Deutsch"},{"$f":"IF(A20=\"\",\"\",IF(Vorgaben!$B$3=\"\",\"\",Vorgaben!$B$3&\" / \")&IF(Vorgaben!$D$3=\"\",\"\",Vorgaben!$D$3&\" / \")&IF(Vorgaben!$F$3=\"\",\"\",IF(Vorgaben!$B$6=\"\",Vorgaben!$F$3&\" / \",Vorgaben!$F$3&\" (\"&Vorgaben!$B$6&\") / \"))&IF(Vorgaben!$H$3=\"\",\"\",IF(Vorgaben!$B$6=\"\",Vorgaben!$H$3&\" / \",Vorgaben!$H$3&\" (\"&Vorgaben!$B$6&\") / \"))&IF(Vorgaben!$D$7=\"\",\"\",IF(Vorgaben!$B$6=\"\",Vorgaben!$D$7,Vorgaben!$D$7&\" (\"&Vorgaben!$B$6&\")\")))","v":"Unterricht / 2020-21 / Stufe 05 (2020-21) / 05b (2020-21)"},{"$f":"IF(OR($A20=\"\",Vorgaben!$H7=\"\"),\"\",Vorgaben!$H7)","v":"VorlageFach"},{"$f":"IF(OR($A20=\"\",Vorgaben!$I$7=\"\"),\"\",$E$2)","v":"self"},{"$f":"IF(OR($A20=\"\",Vorgaben!$I$7=\"\"),\"\",\"editingteacher\")","v":"editingteacher"},{"$f":"IF(OR($A20=\"\",Vorgaben!$I$7=\"\"),\"\",Vorgaben!$I$7)","v":"djv5456+"},{"$f":"IF(OR($A20=\"\",Vorgaben!$I$14=\"\"),\"\",\"self\")","v":""},{"$f":"IF(OR($A20=\"\",Vorgaben!$I$14=\"\"),\"\",\"student\")","v":""},{"$f":"IF(OR($A20=\"\",Vorgaben!$I$14=\"\"),\"\",Vorgaben!$I$14)","v":""}]
[{"$f":"IF(OR(Vorgaben!$D$7=\"\",Vorgaben!$G8=\"\"),\"\",IF(Vorgaben!$B$6=\"\",Vorgaben!$D$7&\" \"&Vorgaben!$G8,Vorgaben!$B$6&\" \"&Vorgaben!$D$7&\" \"&Vorgaben!$G8))","v":"2020-21 05b Englisch"},{"$f":"IF(OR(Vorgaben!$D$7=\"\",Vorgaben!$G8=\"\"),\"\",Vorgaben!$B$6&\" \"&Vorgaben!$D$7&\" \"&Vorgaben!$G8)","v":"2020-21 05b Englisch"},{"$f":"IF(A21=\"\",\"\",IF(Vorgaben!$B$3=\"\",\"\",Vorgaben!$B$3&\" / \")&IF(Vorgaben!$D$3=\"\",\"\",Vorgaben!$D$3&\" / \")&IF(Vorgaben!$F$3=\"\",\"\",IF(Vorgaben!$B$6=\"\",Vorgaben!$F$3&\" / \",Vorgaben!$F$3&\" (\"&Vorgaben!$B$6&\") / \"))&IF(Vorgaben!$H$3=\"\",\"\",IF(Vorgaben!$B$6=\"\",Vorgaben!$H$3&\" / \",Vorgaben!$H$3&\" (\"&Vorgaben!$B$6&\") / \"))&IF(Vorgaben!$D$7=\"\",\"\",IF(Vorgaben!$B$6=\"\",Vorgaben!$D$7,Vorgaben!$D$7&\" (\"&Vorgaben!$B$6&\")\")))","v":"Unterricht / 2020-21 / Stufe 05 (2020-21) / 05b (2020-21)"},{"$f":"IF(OR($A21=\"\",Vorgaben!$H8=\"\"),\"\",Vorgaben!$H8)","v":"VorlageEnglisch"},{"$f":"IF(OR($A21=\"\",Vorgaben!$I$7=\"\"),\"\",$E$2)","v":"self"},{"$f":"IF(OR($A21=\"\",Vorgaben!$I$7=\"\"),\"\",\"editingteacher\")","v":"editingteacher"},{"$f":"IF(OR($A21=\"\",Vorgaben!$I$7=\"\"),\"\",Vorgaben!$I$7)","v":"djv5456+"},{"$f":"IF(OR($A21=\"\",Vorgaben!$I$14=\"\"),\"\",\"self\")","v":""},{"$f":"IF(OR($A21=\"\",Vorgaben!$I$14=\"\"),\"\",\"student\")","v":""},{"$f":"IF(OR($A21=\"\",Vorgaben!$I$14=\"\"),\"\",Vorgaben!$I$14)","v":""}]
[{"$f":"IF(OR(Vorgaben!$D$7=\"\",Vorgaben!$G9=\"\"),\"\",IF(Vorgaben!$B$6=\"\",Vorgaben!$D$7&\" \"&Vorgaben!$G9,Vorgaben!$B$6&\" \"&Vorgaben!$D$7&\" \"&Vorgaben!$G9))","v":"2020-21 05b Mathematik"},{"$f":"IF(OR(Vorgaben!$D$7=\"\",Vorgaben!$G9=\"\"),\"\",Vorgaben!$B$6&\" \"&Vorgaben!$D$7&\" \"&Vorgaben!$G9)","v":"2020-21 05b Mathematik"},{"$f":"IF(A22=\"\",\"\",IF(Vorgaben!$B$3=\"\",\"\",Vorgaben!$B$3&\" / \")&IF(Vorgaben!$D$3=\"\",\"\",Vorgaben!$D$3&\" / \")&IF(Vorgaben!$F$3=\"\",\"\",IF(Vorgaben!$B$6=\"\",Vorgaben!$F$3&\" / \",Vorgaben!$F$3&\" (\"&Vorgaben!$B$6&\") / \"))&IF(Vorgaben!$H$3=\"\",\"\",IF(Vorgaben!$B$6=\"\",Vorgaben!$H$3&\" / \",Vorgaben!$H$3&\" (\"&Vorgaben!$B$6&\") / \"))&IF(Vorgaben!$D$7=\"\",\"\",IF(Vorgaben!$B$6=\"\",Vorgaben!$D$7,Vorgaben!$D$7&\" (\"&Vorgaben!$B$6&\")\")))","v":"Unterricht / 2020-21 / Stufe 05 (2020-21) / 05b (2020-21)"},{"$f":"IF(OR($A22=\"\",Vorgaben!$H9=\"\"),\"\",Vorgaben!$H9)","v":"VorlageFach"},{"$f":"IF(OR($A22=\"\",Vorgaben!$I$7=\"\"),\"\",$E$2)","v":"self"},{"$f":"IF(OR($A22=\"\",Vorgaben!$I$7=\"\"),\"\",\"editingteacher\")","v":"editingteacher"},{"$f":"IF(OR($A22=\"\",Vorgaben!$I$7=\"\"),\"\",Vorgaben!$I$7)","v":"djv5456+"},{"$f":"IF(OR($A22=\"\",Vorgaben!$I$14=\"\"),\"\",\"self\")","v":""},{"$f":"IF(OR($A22=\"\",Vorgaben!$I$14=\"\"),\"\",\"student\")","v":""},{"$f":"IF(OR($A22=\"\",Vorgaben!$I$14=\"\"),\"\",Vorgaben!$I$14)","v":""}]
[{"$f":"IF(OR(Vorgaben!$D$7=\"\",Vorgaben!$G10=\"\"),\"\",IF(Vorgaben!$B$6=\"\",Vorgaben!$D$7&\" \"&Vorgaben!$G10,Vorgaben!$B$6&\" \"&Vorgaben!$D$7&\" \"&Vorgaben!$G10))","v":"2020-21 05b Biologie"},{"$f":"IF(OR(Vorgaben!$D$7=\"\",Vorgaben!$G10=\"\"),\"\",Vorgaben!$B$6&\" \"&Vorgaben!$D$7&\" \"&Vorgaben!$G10)","v":"2020-21 05b Biologie"},{"$f":"IF(A23=\"\",\"\",IF(Vorgaben!$B$3=\"\",\"\",Vorgaben!$B$3&\" / \")&IF(Vorgaben!$D$3=\"\",\"\",Vorgaben!$D$3&\" / \")&IF(Vorgaben!$F$3=\"\",\"\",IF(Vorgaben!$B$6=\"\",Vorgaben!$F$3&\" / \",Vorgaben!$F$3&\" (\"&Vorgaben!$B$6&\") / \"))&IF(Vorgaben!$H$3=\"\",\"\",IF(Vorgaben!$B$6=\"\",Vorgaben!$H$3&\" / \",Vorgaben!$H$3&\" (\"&Vorgaben!$B$6&\") / \"))&IF(Vorgaben!$D$7=\"\",\"\",IF(Vorgaben!$B$6=\"\",Vorgaben!$D$7,Vorgaben!$D$7&\" (\"&Vorgaben!$B$6&\")\")))","v":"Unterricht / 2020-21 / Stufe 05 (2020-21) / 05b (2020-21)"},{"$f":"IF(OR($A23=\"\",Vorgaben!$H10=\"\"),\"\",Vorgaben!$H10)","v":"VorlageFach"},{"$f":"IF(OR($A23=\"\",Vorgaben!$I$7=\"\"),\"\",$E$2)","v":"self"},{"$f":"IF(OR($A23=\"\",Vorgaben!$I$7=\"\"),\"\",\"editingteacher\")","v":"editingteacher"},{"$f":"IF(OR($A23=\"\",Vorgaben!$I$7=\"\"),\"\",Vorgaben!$I$7)","v":"djv5456+"},{"$f":"IF(OR($A23=\"\",Vorgaben!$I$14=\"\"),\"\",\"self\")","v":""},{"$f":"IF(OR($A23=\"\",Vorgaben!$I$14=\"\"),\"\",\"student\")","v":""},{"$f":"IF(OR($A23=\"\",Vorgaben!$I$14=\"\"),\"\",Vorgaben!$I$14)","v":""}]
[{"$f":"IF(OR(Vorgaben!$D$7=\"\",Vorgaben!$G11=\"\"),\"\",IF(Vorgaben!$B$6=\"\",Vorgaben!$D$7&\" \"&Vorgaben!$G11,Vorgaben!$B$6&\" \"&Vorgaben!$D$7&\" \"&Vorgaben!$G11))","v":"2020-21 05b Physik"},{"$f":"IF(OR(Vorgaben!$D$7=\"\",Vorgaben!$G11=\"\"),\"\",Vorgaben!$B$6&\" \"&Vorgaben!$D$7&\" \"&Vorgaben!$G11)","v":"2020-21 05b Physik"},{"$f":"IF(A24=\"\",\"\",IF(Vorgaben!$B$3=\"\",\"\",Vorgaben!$B$3&\" / \")&IF(Vorgaben!$D$3=\"\",\"\",Vorgaben!$D$3&\" / \")&IF(Vorgaben!$F$3=\"\",\"\",IF(Vorgaben!$B$6=\"\",Vorgaben!$F$3&\" / \",Vorgaben!$F$3&\" (\"&Vorgaben!$B$6&\") / \"))&IF(Vorgaben!$H$3=\"\",\"\",IF(Vorgaben!$B$6=\"\",Vorgaben!$H$3&\" / \",Vorgaben!$H$3&\" (\"&Vorgaben!$B$6&\") / \"))&IF(Vorgaben!$D$7=\"\",\"\",IF(Vorgaben!$B$6=\"\",Vorgaben!$D$7,Vorgaben!$D$7&\" (\"&Vorgaben!$B$6&\")\")))","v":"Unterricht / 2020-21 / Stufe 05 (2020-21) / 05b (2020-21)"},{"$f":"IF(OR($A24=\"\",Vorgaben!$H11=\"\"),\"\",Vorgaben!$H11)","v":"VorlageFach"},{"$f":"IF(OR($A24=\"\",Vorgaben!$I$7=\"\"),\"\",$E$2)","v":"self"},{"$f":"IF(OR($A24=\"\",Vorgaben!$I$7=\"\"),\"\",\"editingteacher\")","v":"editingteacher"},{"$f":"IF(OR($A24=\"\",Vorgaben!$I$7=\"\"),\"\",Vorgaben!$I$7)","v":"djv5456+"},{"$f":"IF(OR($A24=\"\",Vorgaben!$I$14=\"\"),\"\",\"self\")","v":""},{"$f":"IF(OR($A24=\"\",Vorgaben!$I$14=\"\"),\"\",\"student\")","v":""},{"$f":"IF(OR($A24=\"\",Vorgaben!$I$14=\"\"),\"\",Vorgaben!$I$14)","v":""}]
[{"$f":"IF(OR(Vorgaben!$D$7=\"\",Vorgaben!$G12=\"\"),\"\",IF(Vorgaben!$B$6=\"\",Vorgaben!$D$7&\" \"&Vorgaben!$G12,Vorgaben!$B$6&\" \"&Vorgaben!$D$7&\" \"&Vorgaben!$G12))","v":"2020-21 05b Sport"},{"$f":"IF(OR(Vorgaben!$D$7=\"\",Vorgaben!$G12=\"\"),\"\",Vorgaben!$B$6&\" \"&Vorgaben!$D$7&\" \"&Vorgaben!$G12)","v":"2020-21 05b Sport"},{"$f":"IF(A25=\"\",\"\",IF(Vorgaben!$B$3=\"\",\"\",Vorgaben!$B$3&\" / \")&IF(Vorgaben!$D$3=\"\",\"\",Vorgaben!$D$3&\" / \")&IF(Vorgaben!$F$3=\"\",\"\",IF(Vorgaben!$B$6=\"\",Vorgaben!$F$3&\" / \",Vorgaben!$F$3&\" (\"&Vorgaben!$B$6&\") / \"))&IF(Vorgaben!$H$3=\"\",\"\",IF(Vorgaben!$B$6=\"\",Vorgaben!$H$3&\" / \",Vorgaben!$H$3&\" (\"&Vorgaben!$B$6&\") / \"))&IF(Vorgaben!$D$7=\"\",\"\",IF(Vorgaben!$B$6=\"\",Vorgaben!$D$7,Vorgaben!$D$7&\" (\"&Vorgaben!$B$6&\")\")))","v":"Unterricht / 2020-21 / Stufe 05 (2020-21) / 05b (2020-21)"},{"$f":"IF(OR($A25=\"\",Vorgaben!$H12=\"\"),\"\",Vorgaben!$H12)","v":"VorlageFach"},{"$f":"IF(OR($A25=\"\",Vorgaben!$I$7=\"\"),\"\",$E$2)","v":"self"},{"$f":"IF(OR($A25=\"\",Vorgaben!$I$7=\"\"),\"\",\"editingteacher\")","v":"editingteacher"},{"$f":"IF(OR($A25=\"\",Vorgaben!$I$7=\"\"),\"\",Vorgaben!$I$7)","v":"djv5456+"},{"$f":"IF(OR($A25=\"\",Vorgaben!$I$14=\"\"),\"\",\"self\")","v":""},{"$f":"IF(OR($A25=\"\",Vorgaben!$I$14=\"\"),\"\",\"student\")","v":""},{"$f":"IF(OR($A25=\"\",Vorgaben!$I$14=\"\"),\"\",Vorgaben!$I$14)","v":""}]
[{"$f":"IF(OR(Vorgaben!$D$7=\"\",Vorgaben!$G13=\"\"),\"\",IF(Vorgaben!$B$6=\"\",Vorgaben!$D$7&\" \"&Vorgaben!$G13,Vorgaben!$B$6&\" \"&Vorgaben!$D$7&\" \"&Vorgaben!$G13))","v":""},{"$f":"IF(OR(Vorgaben!$D$7=\"\",Vorgaben!$G13=\"\"),\"\",Vorgaben!$B$6&\" \"&Vorgaben!$D$7&\" \"&Vorgaben!$G13)","v":""},{"$f":"IF(A26=\"\",\"\",IF(Vorgaben!$B$3=\"\",\"\",Vorgaben!$B$3&\" / \")&IF(Vorgaben!$D$3=\"\",\"\",Vorgaben!$D$3&\" / \")&IF(Vorgaben!$F$3=\"\",\"\",IF(Vorgaben!$B$6=\"\",Vorgaben!$F$3&\" / \",Vorgaben!$F$3&\" (\"&Vorgaben!$B$6&\") / \"))&IF(Vorgaben!$H$3=\"\",\"\",IF(Vorgaben!$B$6=\"\",Vorgaben!$H$3&\" / \",Vorgaben!$H$3&\" (\"&Vorgaben!$B$6&\") / \"))&IF(Vorgaben!$D$7=\"\",\"\",IF(Vorgaben!$B$6=\"\",Vorgaben!$D$7,Vorgaben!$D$7&\" (\"&Vorgaben!$B$6&\")\")))","v":""},{"$f":"IF(OR($A26=\"\",Vorgaben!$H13=\"\"),\"\",Vorgaben!$H13)","v":""},{"$f":"IF(OR($A26=\"\",Vorgaben!$I$7=\"\"),\"\",$E$2)","v":""},{"$f":"IF(OR($A26=\"\",Vorgaben!$I$7=\"\"),\"\",\"editingteacher\")","v":""},{"$f":"IF(OR($A26=\"\",Vorgaben!$I$7=\"\"),\"\",Vorgaben!$I$7)","v":""},{"$f":"IF(OR($A26=\"\",Vorgaben!$I$14=\"\"),\"\",\"self\")","v":""},{"$f":"IF(OR($A26=\"\",Vorgaben!$I$14=\"\"),\"\",\"student\")","v":""},{"$f":"IF(OR($A26=\"\",Vorgaben!$I$14=\"\"),\"\",Vorgaben!$I$14)","v":""}]
[{"$f":"IF(OR(Vorgaben!$D$7=\"\",Vorgaben!$G14=\"\"),\"\",IF(Vorgaben!$B$6=\"\",Vorgaben!$D$7&\" \"&Vorgaben!$G14,Vorgaben!$B$6&\" \"&Vorgaben!$D$7&\" \"&Vorgaben!$G14))","v":""},{"$f":"IF(OR(Vorgaben!$D$7=\"\",Vorgaben!$G14=\"\"),\"\",Vorgaben!$B$6&\" \"&Vorgaben!$D$7&\" \"&Vorgaben!$G14)","v":""},{"$f":"IF(A27=\"\",\"\",IF(Vorgaben!$B$3=\"\",\"\",Vorgaben!$B$3&\" / \")&IF(Vorgaben!$D$3=\"\",\"\",Vorgaben!$D$3&\" / \")&IF(Vorgaben!$F$3=\"\",\"\",IF(Vorgaben!$B$6=\"\",Vorgaben!$F$3&\" / \",Vorgaben!$F$3&\" (\"&Vorgaben!$B$6&\") / \"))&IF(Vorgaben!$H$3=\"\",\"\",IF(Vorgaben!$B$6=\"\",Vorgaben!$H$3&\" / \",Vorgaben!$H$3&\" (\"&Vorgaben!$B$6&\") / \"))&IF(Vorgaben!$D$7=\"\",\"\",IF(Vorgaben!$B$6=\"\",Vorgaben!$D$7,Vorgaben!$D$7&\" (\"&Vorgaben!$B$6&\")\")))","v":""},{"$f":"IF(OR($A27=\"\",Vorgaben!$H14=\"\"),\"\",Vorgaben!$H14)","v":""},{"$f":"IF(OR($A27=\"\",Vorgaben!$I$7=\"\"),\"\",$E$2)","v":""},{"$f":"IF(OR($A27=\"\",Vorgaben!$I$7=\"\"),\"\",\"editingteacher\")","v":""},{"$f":"IF(OR($A27=\"\",Vorgaben!$I$7=\"\"),\"\",Vorgaben!$I$7)","v":""},{"$f":"IF(OR($A27=\"\",Vorgaben!$I$14=\"\"),\"\",\"self\")","v":""},{"$f":"IF(OR($A27=\"\",Vorgaben!$I$14=\"\"),\"\",\"student\")","v":""},{"$f":"IF(OR($A27=\"\",Vorgaben!$I$14=\"\"),\"\",Vorgaben!$I$14)","v":""}]
[{"$f":"IF(OR(Vorgaben!$D$7=\"\",Vorgaben!$G15=\"\"),\"\",IF(Vorgaben!$B$6=\"\",Vorgaben!$D$7&\" \"&Vorgaben!$G15,Vorgaben!$B$6&\" \"&Vorgaben!$D$7&\" \"&Vorgaben!$G15))","v":""},{"$f":"IF(OR(Vorgaben!$D$7=\"\",Vorgaben!$G15=\"\"),\"\",Vorgaben!$B$6&\" \"&Vorgaben!$D$7&\" \"&Vorgaben!$G15)","v":""},{"$f":"IF(A28=\"\",\"\",IF(Vorgaben!$B$3=\"\",\"\",Vorgaben!$B$3&\" / \")&IF(Vorgaben!$D$3=\"\",\"\",Vorgaben!$D$3&\" / \")&IF(Vorgaben!$F$3=\"\",\"\",IF(Vorgaben!$B$6=\"\",Vorgaben!$F$3&\" / \",Vorgaben!$F$3&\" (\"&Vorgaben!$B$6&\") / \"))&IF(Vorgaben!$H$3=\"\",\"\",IF(Vorgaben!$B$6=\"\",Vorgaben!$H$3&\" / \",Vorgaben!$H$3&\" (\"&Vorgaben!$B$6&\") / \"))&IF(Vorgaben!$D$7=\"\",\"\",IF(Vorgaben!$B$6=\"\",Vorgaben!$D$7,Vorgaben!$D$7&\" (\"&Vorgaben!$B$6&\")\")))","v":""},{"$f":"IF(OR($A28=\"\",Vorgaben!$H15=\"\"),\"\",Vorgaben!$H15)","v":""},{"$f":"IF(OR($A28=\"\",Vorgaben!$I$7=\"\"),\"\",$E$2)","v":""},{"$f":"IF(OR($A28=\"\",Vorgaben!$I$7=\"\"),\"\",\"editingteacher\")","v":""},{"$f":"IF(OR($A28=\"\",Vorgaben!$I$7=\"\"),\"\",Vorgaben!$I$7)","v":""},{"$f":"IF(OR($A28=\"\",Vorgaben!$I$14=\"\"),\"\",\"self\")","v":""},{"$f":"IF(OR($A28=\"\",Vorgaben!$I$14=\"\"),\"\",\"student\")","v":""},{"$f":"IF(OR($A28=\"\",Vorgaben!$I$14=\"\"),\"\",Vorgaben!$I$14)","v":""}]
[{"$f":"IF(OR(Vorgaben!$D$7=\"\",Vorgaben!$G16=\"\"),\"\",IF(Vorgaben!$B$6=\"\",Vorgaben!$D$7&\" \"&Vorgaben!$G16,Vorgaben!$B$6&\" \"&Vorgaben!$D$7&\" \"&Vorgaben!$G16))","v":""},{"$f":"IF(OR(Vorgaben!$D$7=\"\",Vorgaben!$G16=\"\"),\"\",Vorgaben!$B$6&\" \"&Vorgaben!$D$7&\" \"&Vorgaben!$G16)","v":""},{"$f":"IF(A29=\"\",\"\",IF(Vorgaben!$B$3=\"\",\"\",Vorgaben!$B$3&\" / \")&IF(Vorgaben!$D$3=\"\",\"\",Vorgaben!$D$3&\" / \")&IF(Vorgaben!$F$3=\"\",\"\",IF(Vorgaben!$B$6=\"\",Vorgaben!$F$3&\" / \",Vorgaben!$F$3&\" (\"&Vorgaben!$B$6&\") / \"))&IF(Vorgaben!$H$3=\"\",\"\",IF(Vorgaben!$B$6=\"\",Vorgaben!$H$3&\" / \",Vorgaben!$H$3&\" (\"&Vorgaben!$B$6&\") / \"))&IF(Vorgaben!$D$7=\"\",\"\",IF(Vorgaben!$B$6=\"\",Vorgaben!$D$7,Vorgaben!$D$7&\" (\"&Vorgaben!$B$6&\")\")))","v":""},{"$f":"IF(OR($A29=\"\",Vorgaben!$H16=\"\"),\"\",Vorgaben!$H16)","v":""},{"$f":"IF(OR($A29=\"\",Vorgaben!$I$7=\"\"),\"\",$E$2)","v":""},{"$f":"IF(OR($A29=\"\",Vorgaben!$I$7=\"\"),\"\",\"editingteacher\")","v":""},{"$f":"IF(OR($A29=\"\",Vorgaben!$I$7=\"\"),\"\",Vorgaben!$I$7)","v":""},{"$f":"IF(OR($A29=\"\",Vorgaben!$I$14=\"\"),\"\",\"self\")","v":""},{"$f":"IF(OR($A29=\"\",Vorgaben!$I$14=\"\"),\"\",\"student\")","v":""},{"$f":"IF(OR($A29=\"\",Vorgaben!$I$14=\"\"),\"\",Vorgaben!$I$14)","v":""}]
[{"$f":"IF(OR(Vorgaben!$D$7=\"\",Vorgaben!$G17=\"\"),\"\",IF(Vorgaben!$B$6=\"\",Vorgaben!$D$7&\" \"&Vorgaben!$G17,Vorgaben!$B$6&\" \"&Vorgaben!$D$7&\" \"&Vorgaben!$G17))","v":""},{"$f":"IF(OR(Vorgaben!$D$7=\"\",Vorgaben!$G17=\"\"),\"\",Vorgaben!$B$6&\" \"&Vorgaben!$D$7&\" \"&Vorgaben!$G17)","v":""},{"$f":"IF(A30=\"\",\"\",IF(Vorgaben!$B$3=\"\",\"\",Vorgaben!$B$3&\" / \")&IF(Vorgaben!$D$3=\"\",\"\",Vorgaben!$D$3&\" / \")&IF(Vorgaben!$F$3=\"\",\"\",IF(Vorgaben!$B$6=\"\",Vorgaben!$F$3&\" / \",Vorgaben!$F$3&\" (\"&Vorgaben!$B$6&\") / \"))&IF(Vorgaben!$H$3=\"\",\"\",IF(Vorgaben!$B$6=\"\",Vorgaben!$H$3&\" / \",Vorgaben!$H$3&\" (\"&Vorgaben!$B$6&\") / \"))&IF(Vorgaben!$D$7=\"\",\"\",IF(Vorgaben!$B$6=\"\",Vorgaben!$D$7,Vorgaben!$D$7&\" (\"&Vorgaben!$B$6&\")\")))","v":""},{"$f":"IF(OR($A30=\"\",Vorgaben!$H17=\"\"),\"\",Vorgaben!$H17)","v":""},{"$f":"IF(OR($A30=\"\",Vorgaben!$I$7=\"\"),\"\",$E$2)","v":""},{"$f":"IF(OR($A30=\"\",Vorgaben!$I$7=\"\"),\"\",\"editingteacher\")","v":""},{"$f":"IF(OR($A30=\"\",Vorgaben!$I$7=\"\"),\"\",Vorgaben!$I$7)","v":""},{"$f":"IF(OR($A30=\"\",Vorgaben!$I$14=\"\"),\"\",\"self\")","v":""},{"$f":"IF(OR($A30=\"\",Vorgaben!$I$14=\"\"),\"\",\"student\")","v":""},{"$f":"IF(OR($A30=\"\",Vorgaben!$I$14=\"\"),\"\",Vorgaben!$I$14)","v":""}]
[{"$f":"IF(OR(Vorgaben!$D$7=\"\",Vorgaben!$G18=\"\"),\"\",IF(Vorgaben!$B$6=\"\",Vorgaben!$D$7&\" \"&Vorgaben!$G18,Vorgaben!$B$6&\" \"&Vorgaben!$D$7&\" \"&Vorgaben!$G18))","v":""},{"$f":"IF(OR(Vorgaben!$D$7=\"\",Vorgaben!$G18=\"\"),\"\",Vorgaben!$B$6&\" \"&Vorgaben!$D$7&\" \"&Vorgaben!$G18)","v":""},{"$f":"IF(A31=\"\",\"\",IF(Vorgaben!$B$3=\"\",\"\",Vorgaben!$B$3&\" / \")&IF(Vorgaben!$D$3=\"\",\"\",Vorgaben!$D$3&\" / \")&IF(Vorgaben!$F$3=\"\",\"\",IF(Vorgaben!$B$6=\"\",Vorgaben!$F$3&\" / \",Vorgaben!$F$3&\" (\"&Vorgaben!$B$6&\") / \"))&IF(Vorgaben!$H$3=\"\",\"\",IF(Vorgaben!$B$6=\"\",Vorgaben!$H$3&\" / \",Vorgaben!$H$3&\" (\"&Vorgaben!$B$6&\") / \"))&IF(Vorgaben!$D$7=\"\",\"\",IF(Vorgaben!$B$6=\"\",Vorgaben!$D$7,Vorgaben!$D$7&\" (\"&Vorgaben!$B$6&\")\")))","v":""},{"$f":"IF(OR($A31=\"\",Vorgaben!$H18=\"\"),\"\",Vorgaben!$H18)","v":""},{"$f":"IF(OR($A31=\"\",Vorgaben!$I$7=\"\"),\"\",$E$2)","v":""},{"$f":"IF(OR($A31=\"\",Vorgaben!$I$7=\"\"),\"\",\"editingteacher\")","v":""},{"$f":"IF(OR($A31=\"\",Vorgaben!$I$7=\"\"),\"\",Vorgaben!$I$7)","v":""},{"$f":"IF(OR($A31=\"\",Vorgaben!$I$14=\"\"),\"\",\"self\")","v":""},{"$f":"IF(OR($A31=\"\",Vorgaben!$I$14=\"\"),\"\",\"student\")","v":""},{"$f":"IF(OR($A31=\"\",Vorgaben!$I$14=\"\"),\"\",Vorgaben!$I$14)","v":""}]
[{"$f":"IF(OR(Vorgaben!$D$7=\"\",Vorgaben!$G19=\"\"),\"\",IF(Vorgaben!$B$6=\"\",Vorgaben!$D$7&\" \"&Vorgaben!$G19,Vorgaben!$B$6&\" \"&Vorgaben!$D$7&\" \"&Vorgaben!$G19))","v":""},{"$f":"IF(OR(Vorgaben!$D$7=\"\",Vorgaben!$G19=\"\"),\"\",Vorgaben!$B$6&\" \"&Vorgaben!$D$7&\" \"&Vorgaben!$G19)","v":""},{"$f":"IF(A32=\"\",\"\",IF(Vorgaben!$B$3=\"\",\"\",Vorgaben!$B$3&\" / \")&IF(Vorgaben!$D$3=\"\",\"\",Vorgaben!$D$3&\" / \")&IF(Vorgaben!$F$3=\"\",\"\",IF(Vorgaben!$B$6=\"\",Vorgaben!$F$3&\" / \",Vorgaben!$F$3&\" (\"&Vorgaben!$B$6&\") / \"))&IF(Vorgaben!$H$3=\"\",\"\",IF(Vorgaben!$B$6=\"\",Vorgaben!$H$3&\" / \",Vorgaben!$H$3&\" (\"&Vorgaben!$B$6&\") / \"))&IF(Vorgaben!$D$7=\"\",\"\",IF(Vorgaben!$B$6=\"\",Vorgaben!$D$7,Vorgaben!$D$7&\" (\"&Vorgaben!$B$6&\")\")))","v":""},{"$f":"IF(OR($A32=\"\",Vorgaben!$H19=\"\"),\"\",Vorgaben!$H19)","v":""},{"$f":"IF(OR($A32=\"\",Vorgaben!$I$7=\"\"),\"\",$E$2)","v":""},{"$f":"IF(OR($A32=\"\",Vorgaben!$I$7=\"\"),\"\",\"editingteacher\")","v":""},{"$f":"IF(OR($A32=\"\",Vorgaben!$I$7=\"\"),\"\",Vorgaben!$I$7)","v":""},{"$f":"IF(OR($A32=\"\",Vorgaben!$I$14=\"\"),\"\",\"self\")","v":""},{"$f":"IF(OR($A32=\"\",Vorgaben!$I$14=\"\"),\"\",\"student\")","v":""},{"$f":"IF(OR($A32=\"\",Vorgaben!$I$14=\"\"),\"\",Vorgaben!$I$14)","v":""}]
[{"$f":"IF(OR(Vorgaben!$D$7=\"\",Vorgaben!$G20=\"\"),\"\",IF(Vorgaben!$B$6=\"\",Vorgaben!$D$7&\" \"&Vorgaben!$G20,Vorgaben!$B$6&\" \"&Vorgaben!$D$7&\" \"&Vorgaben!$G20))","v":""},{"$f":"IF(OR(Vorgaben!$D$7=\"\",Vorgaben!$G20=\"\"),\"\",Vorgaben!$B$6&\" \"&Vorgaben!$D$7&\" \"&Vorgaben!$G20)","v":""},{"$f":"IF(A33=\"\",\"\",IF(Vorgaben!$B$3=\"\",\"\",Vorgaben!$B$3&\" / \")&IF(Vorgaben!$D$3=\"\",\"\",Vorgaben!$D$3&\" / \")&IF(Vorgaben!$F$3=\"\",\"\",IF(Vorgaben!$B$6=\"\",Vorgaben!$F$3&\" / \",Vorgaben!$F$3&\" (\"&Vorgaben!$B$6&\") / \"))&IF(Vorgaben!$H$3=\"\",\"\",IF(Vorgaben!$B$6=\"\",Vorgaben!$H$3&\" / \",Vorgaben!$H$3&\" (\"&Vorgaben!$B$6&\") / \"))&IF(Vorgaben!$D$7=\"\",\"\",IF(Vorgaben!$B$6=\"\",Vorgaben!$D$7,Vorgaben!$D$7&\" (\"&Vorgaben!$B$6&\")\")))","v":""},{"$f":"IF(OR($A33=\"\",Vorgaben!$H20=\"\"),\"\",Vorgaben!$H20)","v":""},{"$f":"IF(OR($A33=\"\",Vorgaben!$I$7=\"\"),\"\",$E$2)","v":""},{"$f":"IF(OR($A33=\"\",Vorgaben!$I$7=\"\"),\"\",\"editingteacher\")","v":""},{"$f":"IF(OR($A33=\"\",Vorgaben!$I$7=\"\"),\"\",Vorgaben!$I$7)","v":""},{"$f":"IF(OR($A33=\"\",Vorgaben!$I$14=\"\"),\"\",\"self\")","v":""},{"$f":"IF(OR($A33=\"\",Vorgaben!$I$14=\"\"),\"\",\"student\")","v":""},{"$f":"IF(OR($A33=\"\",Vorgaben!$I$14=\"\"),\"\",Vorgaben!$I$14)","v":""}]
[{"$f":"IF(OR(Vorgaben!$D$7=\"\",Vorgaben!$G21=\"\"),\"\",IF(Vorgaben!$B$6=\"\",Vorgaben!$D$7&\" \"&Vorgaben!$G21,Vorgaben!$B$6&\" \"&Vorgaben!$D$7&\" \"&Vorgaben!$G21))","v":""},{"$f":"IF(OR(Vorgaben!$D$7=\"\",Vorgaben!$G21=\"\"),\"\",Vorgaben!$B$6&\" \"&Vorgaben!$D$7&\" \"&Vorgaben!$G21)","v":""},{"$f":"IF(A34=\"\",\"\",IF(Vorgaben!$B$3=\"\",\"\",Vorgaben!$B$3&\" / \")&IF(Vorgaben!$D$3=\"\",\"\",Vorgaben!$D$3&\" / \")&IF(Vorgaben!$F$3=\"\",\"\",IF(Vorgaben!$B$6=\"\",Vorgaben!$F$3&\" / \",Vorgaben!$F$3&\" (\"&Vorgaben!$B$6&\") / \"))&IF(Vorgaben!$H$3=\"\",\"\",IF(Vorgaben!$B$6=\"\",Vorgaben!$H$3&\" / \",Vorgaben!$H$3&\" (\"&Vorgaben!$B$6&\") / \"))&IF(Vorgaben!$D$7=\"\",\"\",IF(Vorgaben!$B$6=\"\",Vorgaben!$D$7,Vorgaben!$D$7&\" (\"&Vorgaben!$B$6&\")\")))","v":""},{"$f":"IF(OR($A34=\"\",Vorgaben!$H21=\"\"),\"\",Vorgaben!$H21)","v":""},{"$f":"IF(OR($A34=\"\",Vorgaben!$I$7=\"\"),\"\",$E$2)","v":""},{"$f":"IF(OR($A34=\"\",Vorgaben!$I$7=\"\"),\"\",\"editingteacher\")","v":""},{"$f":"IF(OR($A34=\"\",Vorgaben!$I$7=\"\"),\"\",Vorgaben!$I$7)","v":""},{"$f":"IF(OR($A34=\"\",Vorgaben!$I$14=\"\"),\"\",\"self\")","v":""},{"$f":"IF(OR($A34=\"\",Vorgaben!$I$14=\"\"),\"\",\"student\")","v":""},{"$f":"IF(OR($A34=\"\",Vorgaben!$I$14=\"\"),\"\",Vorgaben!$I$14)","v":""}]
[]
[{"$f":"IF(OR(Vorgaben!$D$8=\"\",Vorgaben!$G6=\"\"),\"\",IF(Vorgaben!$B$6=\"\",Vorgaben!$D$8&\" \"&Vorgaben!$G6,Vorgaben!$B$6&\" \"&Vorgaben!$D$8&\" \"&Vorgaben!$G6))","v":"2020-21 05c Klassenraum"},{"$f":"A36","v":"2020-21 05c Klassenraum"},{"$f":"IF(A19=\"\",\"\",IF(Vorgaben!$B$3=\"\",\"\",Vorgaben!$B$3&\" / \")&IF(Vorgaben!$D$3=\"\",\"\",Vorgaben!$D$3&\" / \")&IF(Vorgaben!$F$3=\"\",\"\",IF(Vorgaben!$B$6=\"\",Vorgaben!$F$3&\" / \",Vorgaben!$F$3&\" (\"&Vorgaben!$B$6&\") / \"))&IF(Vorgaben!$H$3=\"\",\"\",IF(Vorgaben!$B$6=\"\",Vorgaben!$H$3&\" / \",Vorgaben!$H$3&\" (\"&Vorgaben!$B$6&\") / \"))&IF(Vorgaben!$D$8=\"\",\"\",IF(Vorgaben!$B$6=\"\",Vorgaben!$D$8,Vorgaben!$D$7&\" (\"&Vorgaben!$B$6&\")\")))","v":"Unterricht / 2020-21 / Stufe 05 (2020-21) / 05b (2020-21)"},{"$f":"IF(OR($A36=\"\",Vorgaben!$H6=\"\"),\"\",Vorgaben!$H6)","v":"VorlageKlasse"},{"$f":"IF(OR($A36=\"\",Vorgaben!$I$7=\"\"),\"\",$E$2)","v":"self"},{"$f":"IF(OR($A36=\"\",Vorgaben!$I$7=\"\"),\"\",\"editingteacher\")","v":"editingteacher"},{"$f":"IF(OR($A36=\"\",Vorgaben!$I$7=\"\"),\"\",Vorgaben!$I$7)","v":"djv5456+"},{"$f":"IF(OR($A36=\"\",Vorgaben!$I$14=\"\"),\"\",\"self\")","v":""},{"$f":"IF(OR($A36=\"\",Vorgaben!$I$14=\"\"),\"\",\"student\")","v":""},{"$f":"IF(OR($A36=\"\",Vorgaben!$I$14=\"\"),\"\",Vorgaben!$I$14)","v":""}]
[{"$f":"IF(OR(Vorgaben!$D$8=\"\",Vorgaben!$G7=\"\"),\"\",IF(Vorgaben!$B$6=\"\",Vorgaben!$D$8&\" \"&Vorgaben!$G7,Vorgaben!$B$6&\" \"&Vorgaben!$D$8&\" \"&Vorgaben!$G7))","v":"2020-21 05c Deutsch"},{"$f":"A37","v":"2020-21 05c Deutsch"},{"$f":"IF(A20=\"\",\"\",IF(Vorgaben!$B$3=\"\",\"\",Vorgaben!$B$3&\" / \")&IF(Vorgaben!$D$3=\"\",\"\",Vorgaben!$D$3&\" / \")&IF(Vorgaben!$F$3=\"\",\"\",IF(Vorgaben!$B$6=\"\",Vorgaben!$F$3&\" / \",Vorgaben!$F$3&\" (\"&Vorgaben!$B$6&\") / \"))&IF(Vorgaben!$H$3=\"\",\"\",IF(Vorgaben!$B$6=\"\",Vorgaben!$H$3&\" / \",Vorgaben!$H$3&\" (\"&Vorgaben!$B$6&\") / \"))&IF(Vorgaben!$D$8=\"\",\"\",IF(Vorgaben!$B$6=\"\",Vorgaben!$D$8,Vorgaben!$D$7&\" (\"&Vorgaben!$B$6&\")\")))","v":"Unterricht / 2020-21 / Stufe 05 (2020-21) / 05b (2020-21)"},{"$f":"IF(OR($A37=\"\",Vorgaben!$H7=\"\"),\"\",Vorgaben!$H7)","v":"VorlageFach"},{"$f":"IF(OR($A37=\"\",Vorgaben!$I$7=\"\"),\"\",$E$2)","v":"self"},{"$f":"IF(OR($A37=\"\",Vorgaben!$I$7=\"\"),\"\",\"editingteacher\")","v":"editingteacher"},{"$f":"IF(OR($A37=\"\",Vorgaben!$I$7=\"\"),\"\",Vorgaben!$I$7)","v":"djv5456+"},{"$f":"IF(OR($A37=\"\",Vorgaben!$I$14=\"\"),\"\",\"self\")","v":""},{"$f":"IF(OR($A37=\"\",Vorgaben!$I$14=\"\"),\"\",\"student\")","v":""},{"$f":"IF(OR($A37=\"\",Vorgaben!$I$14=\"\"),\"\",Vorgaben!$I$14)","v":""}]
[{"$f":"IF(OR(Vorgaben!$D$8=\"\",Vorgaben!$G8=\"\"),\"\",IF(Vorgaben!$B$6=\"\",Vorgaben!$D$8&\" \"&Vorgaben!$G8,Vorgaben!$B$6&\" \"&Vorgaben!$D$8&\" \"&Vorgaben!$G8))","v":"2020-21 05c Englisch"},"2020-21 05c Englisch",{"$f":"IF(A21=\"\",\"\",IF(Vorgaben!$B$3=\"\",\"\",Vorgaben!$B$3&\" / \")&IF(Vorgaben!$D$3=\"\",\"\",Vorgaben!$D$3&\" / \")&IF(Vorgaben!$F$3=\"\",\"\",IF(Vorgaben!$B$6=\"\",Vorgaben!$F$3&\" / \",Vorgaben!$F$3&\" (\"&Vorgaben!$B$6&\") / \"))&IF(Vorgaben!$H$3=\"\",\"\",IF(Vorgaben!$B$6=\"\",Vorgaben!$H$3&\" / \",Vorgaben!$H$3&\" (\"&Vorgaben!$B$6&\") / \"))&IF(Vorgaben!$D$8=\"\",\"\",IF(Vorgaben!$B$6=\"\",Vorgaben!$D$8,Vorgaben!$D$7&\" (\"&Vorgaben!$B$6&\")\")))","v":"Unterricht / 2020-21 / Stufe 05 (2020-21) / 05b (2020-21)"},{"$f":"IF(OR($A38=\"\",Vorgaben!$H8=\"\"),\"\",Vorgaben!$H8)","v":"VorlageEnglisch"},{"$f":"IF(OR($A38=\"\",Vorgaben!$I$7=\"\"),\"\",$E$2)","v":"self"},{"$f":"IF(OR($A38=\"\",Vorgaben!$I$7=\"\"),\"\",\"editingteacher\")","v":"editingteacher"},{"$f":"IF(OR($A38=\"\",Vorgaben!$I$7=\"\"),\"\",Vorgaben!$I$7)","v":"djv5456+"},{"$f":"IF(OR($A38=\"\",Vorgaben!$I$14=\"\"),\"\",\"self\")","v":""},{"$f":"IF(OR($A38=\"\",Vorgaben!$I$14=\"\"),\"\",\"student\")","v":""},{"$f":"IF(OR($A38=\"\",Vorgaben!$I$14=\"\"),\"\",Vorgaben!$I$14)","v":""}]
[{"$f":"IF(OR(Vorgaben!$D$8=\"\",Vorgaben!$G9=\"\"),\"\",IF(Vorgaben!$B$6=\"\",Vorgaben!$D$8&\" \"&Vorgaben!$G9,Vorgaben!$B$6&\" \"&Vorgaben!$D$8&\" \"&Vorgaben!$G9))","v":"2020-21 05c Mathematik"},"2020-21 05c Mathematik",{"$f":"IF(A22=\"\",\"\",IF(Vorgaben!$B$3=\"\",\"\",Vorgaben!$B$3&\" / \")&IF(Vorgaben!$D$3=\"\",\"\",Vorgaben!$D$3&\" / \")&IF(Vorgaben!$F$3=\"\",\"\",IF(Vorgaben!$B$6=\"\",Vorgaben!$F$3&\" / \",Vorgaben!$F$3&\" (\"&Vorgaben!$B$6&\") / \"))&IF(Vorgaben!$H$3=\"\",\"\",IF(Vorgaben!$B$6=\"\",Vorgaben!$H$3&\" / \",Vorgaben!$H$3&\" (\"&Vorgaben!$B$6&\") / \"))&IF(Vorgaben!$D$8=\"\",\"\",IF(Vorgaben!$B$6=\"\",Vorgaben!$D$8,Vorgaben!$D$7&\" (\"&Vorgaben!$B$6&\")\")))","v":"Unterricht / 2020-21 / Stufe 05 (2020-21) / 05b (2020-21)"},{"$f":"IF(OR($A39=\"\",Vorgaben!$H9=\"\"),\"\",Vorgaben!$H9)","v":"VorlageFach"},{"$f":"IF(OR($A39=\"\",Vorgaben!$I$7=\"\"),\"\",$E$2)","v":"self"},{"$f":"IF(OR($A39=\"\",Vorgaben!$I$7=\"\"),\"\",\"editingteacher\")","v":"editingteacher"},{"$f":"IF(OR($A39=\"\",Vorgaben!$I$7=\"\"),\"\",Vorgaben!$I$7)","v":"djv5456+"},{"$f":"IF(OR($A39=\"\",Vorgaben!$I$14=\"\"),\"\",\"self\")","v":""},{"$f":"IF(OR($A39=\"\",Vorgaben!$I$14=\"\"),\"\",\"student\")","v":""},{"$f":"IF(OR($A39=\"\",Vorgaben!$I$14=\"\"),\"\",Vorgaben!$I$14)","v":""}]
[{"$f":"IF(OR(Vorgaben!$D$8=\"\",Vorgaben!$G10=\"\"),\"\",IF(Vorgaben!$B$6=\"\",Vorgaben!$D$8&\" \"&Vorgaben!$G10,Vorgaben!$B$6&\" \"&Vorgaben!$D$8&\" \"&Vorgaben!$G10))","v":"2020-21 05c Biologie"},"2020-21 05c Biologie",{"$f":"IF(A23=\"\",\"\",IF(Vorgaben!$B$3=\"\",\"\",Vorgaben!$B$3&\" / \")&IF(Vorgaben!$D$3=\"\",\"\",Vorgaben!$D$3&\" / \")&IF(Vorgaben!$F$3=\"\",\"\",IF(Vorgaben!$B$6=\"\",Vorgaben!$F$3&\" / \",Vorgaben!$F$3&\" (\"&Vorgaben!$B$6&\") / \"))&IF(Vorgaben!$H$3=\"\",\"\",IF(Vorgaben!$B$6=\"\",Vorgaben!$H$3&\" / \",Vorgaben!$H$3&\" (\"&Vorgaben!$B$6&\") / \"))&IF(Vorgaben!$D$8=\"\",\"\",IF(Vorgaben!$B$6=\"\",Vorgaben!$D$8,Vorgaben!$D$7&\" (\"&Vorgaben!$B$6&\")\")))","v":"Unterricht / 2020-21 / Stufe 05 (2020-21) / 05b (2020-21)"},{"$f":"IF(OR($A40=\"\",Vorgaben!$H10=\"\"),\"\",Vorgaben!$H10)","v":"VorlageFach"},{"$f":"IF(OR($A40=\"\",Vorgaben!$I$7=\"\"),\"\",$E$2)","v":"self"},{"$f":"IF(OR($A40=\"\",Vorgaben!$I$7=\"\"),\"\",\"editingteacher\")","v":"editingteacher"},{"$f":"IF(OR($A40=\"\",Vorgaben!$I$7=\"\"),\"\",Vorgaben!$I$7)","v":"djv5456+"},{"$f":"IF(OR($A40=\"\",Vorgaben!$I$14=\"\"),\"\",\"self\")","v":""},{"$f":"IF(OR($A40=\"\",Vorgaben!$I$14=\"\"),\"\",\"student\")","v":""},{"$f":"IF(OR($A40=\"\",Vorgaben!$I$14=\"\"),\"\",Vorgaben!$I$14)","v":""}]
[{"$f":"IF(OR(Vorgaben!$D$8=\"\",Vorgaben!$G11=\"\"),\"\",IF(Vorgaben!$B$6=\"\",Vorgaben!$D$8&\" \"&Vorgaben!$G11,Vorgaben!$B$6&\" \"&Vorgaben!$D$8&\" \"&Vorgaben!$G11))","v":"2020-21 05c Physik"},"2020-21 05c Physik",{"$f":"IF(A24=\"\",\"\",IF(Vorgaben!$B$3=\"\",\"\",Vorgaben!$B$3&\" / \")&IF(Vorgaben!$D$3=\"\",\"\",Vorgaben!$D$3&\" / \")&IF(Vorgaben!$F$3=\"\",\"\",IF(Vorgaben!$B$6=\"\",Vorgaben!$F$3&\" / \",Vorgaben!$F$3&\" (\"&Vorgaben!$B$6&\") / \"))&IF(Vorgaben!$H$3=\"\",\"\",IF(Vorgaben!$B$6=\"\",Vorgaben!$H$3&\" / \",Vorgaben!$H$3&\" (\"&Vorgaben!$B$6&\") / \"))&IF(Vorgaben!$D$8=\"\",\"\",IF(Vorgaben!$B$6=\"\",Vorgaben!$D$8,Vorgaben!$D$7&\" (\"&Vorgaben!$B$6&\")\")))","v":"Unterricht / 2020-21 / Stufe 05 (2020-21) / 05b (2020-21)"},{"$f":"IF(OR($A41=\"\",Vorgaben!$H11=\"\"),\"\",Vorgaben!$H11)","v":"VorlageFach"},{"$f":"IF(OR($A41=\"\",Vorgaben!$I$7=\"\"),\"\",$E$2)","v":"self"},{"$f":"IF(OR($A41=\"\",Vorgaben!$I$7=\"\"),\"\",\"editingteacher\")","v":"editingteacher"},{"$f":"IF(OR($A41=\"\",Vorgaben!$I$7=\"\"),\"\",Vorgaben!$I$7)","v":"djv5456+"},{"$f":"IF(OR($A41=\"\",Vorgaben!$I$14=\"\"),\"\",\"self\")","v":""},{"$f":"IF(OR($A41=\"\",Vorgaben!$I$14=\"\"),\"\",\"student\")","v":""},{"$f":"IF(OR($A41=\"\",Vorgaben!$I$14=\"\"),\"\",Vorgaben!$I$14)","v":""}]
[{"$f":"IF(OR(Vorgaben!$D$8=\"\",Vorgaben!$G12=\"\"),\"\",IF(Vorgaben!$B$6=\"\",Vorgaben!$D$8&\" \"&Vorgaben!$G12,Vorgaben!$B$6&\" \"&Vorgaben!$D$8&\" \"&Vorgaben!$G12))","v":"2020-21 05c Sport"},"2020-21 05c Sport",{"$f":"IF(A25=\"\",\"\",IF(Vorgaben!$B$3=\"\",\"\",Vorgaben!$B$3&\" / \")&IF(Vorgaben!$D$3=\"\",\"\",Vorgaben!$D$3&\" / \")&IF(Vorgaben!$F$3=\"\",\"\",IF(Vorgaben!$B$6=\"\",Vorgaben!$F$3&\" / \",Vorgaben!$F$3&\" (\"&Vorgaben!$B$6&\") / \"))&IF(Vorgaben!$H$3=\"\",\"\",IF(Vorgaben!$B$6=\"\",Vorgaben!$H$3&\" / \",Vorgaben!$H$3&\" (\"&Vorgaben!$B$6&\") / \"))&IF(Vorgaben!$D$8=\"\",\"\",IF(Vorgaben!$B$6=\"\",Vorgaben!$D$8,Vorgaben!$D$7&\" (\"&Vorgaben!$B$6&\")\")))","v":"Unterricht / 2020-21 / Stufe 05 (2020-21) / 05b (2020-21)"},{"$f":"IF(OR($A42=\"\",Vorgaben!$H12=\"\"),\"\",Vorgaben!$H12)","v":"VorlageFach"},{"$f":"IF(OR($A42=\"\",Vorgaben!$I$7=\"\"),\"\",$E$2)","v":"self"},{"$f":"IF(OR($A42=\"\",Vorgaben!$I$7=\"\"),\"\",\"editingteacher\")","v":"editingteacher"},{"$f":"IF(OR($A42=\"\",Vorgaben!$I$7=\"\"),\"\",Vorgaben!$I$7)","v":"djv5456+"},{"$f":"IF(OR($A42=\"\",Vorgaben!$I$14=\"\"),\"\",\"self\")","v":""},{"$f":"IF(OR($A42=\"\",Vorgaben!$I$14=\"\"),\"\",\"student\")","v":""},{"$f":"IF(OR($A42=\"\",Vorgaben!$I$14=\"\"),\"\",Vorgaben!$I$14)","v":""}]
[{"$f":"IF(OR(Vorgaben!$D$8=\"\",Vorgaben!$G13=\"\"),\"\",IF(Vorgaben!$B$6=\"\",Vorgaben!$D$8&\" \"&Vorgaben!$G13,Vorgaben!$B$6&\" \"&Vorgaben!$D$8&\" \"&Vorgaben!$G13))","v":""},"",{"$f":"IF(A26=\"\",\"\",IF(Vorgaben!$B$3=\"\",\"\",Vorgaben!$B$3&\" / \")&IF(Vorgaben!$D$3=\"\",\"\",Vorgaben!$D$3&\" / \")&IF(Vorgaben!$F$3=\"\",\"\",IF(Vorgaben!$B$6=\"\",Vorgaben!$F$3&\" / \",Vorgaben!$F$3&\" (\"&Vorgaben!$B$6&\") / \"))&IF(Vorgaben!$H$3=\"\",\"\",IF(Vorgaben!$B$6=\"\",Vorgaben!$H$3&\" / \",Vorgaben!$H$3&\" (\"&Vorgaben!$B$6&\") / \"))&IF(Vorgaben!$D$8=\"\",\"\",IF(Vorgaben!$B$6=\"\",Vorgaben!$D$8,Vorgaben!$D$7&\" (\"&Vorgaben!$B$6&\")\")))","v":""},{"$f":"IF(OR($A43=\"\",Vorgaben!$H13=\"\"),\"\",Vorgaben!$H13)","v":""},{"$f":"IF(OR($A43=\"\",Vorgaben!$I$7=\"\"),\"\",$E$2)","v":""},{"$f":"IF(OR($A43=\"\",Vorgaben!$I$7=\"\"),\"\",\"editingteacher\")","v":""},{"$f":"IF(OR($A43=\"\",Vorgaben!$I$7=\"\"),\"\",Vorgaben!$I$7)","v":""},{"$f":"IF(OR($A43=\"\",Vorgaben!$I$14=\"\"),\"\",\"self\")","v":""},{"$f":"IF(OR($A43=\"\",Vorgaben!$I$14=\"\"),\"\",\"student\")","v":""},{"$f":"IF(OR($A43=\"\",Vorgaben!$I$14=\"\"),\"\",Vorgaben!$I$14)","v":""}]
[{"$f":"IF(OR(Vorgaben!$D$8=\"\",Vorgaben!$G14=\"\"),\"\",IF(Vorgaben!$B$6=\"\",Vorgaben!$D$8&\" \"&Vorgaben!$G14,Vorgaben!$B$6&\" \"&Vorgaben!$D$8&\" \"&Vorgaben!$G14))","v":""},"",{"$f":"IF(A27=\"\",\"\",IF(Vorgaben!$B$3=\"\",\"\",Vorgaben!$B$3&\" / \")&IF(Vorgaben!$D$3=\"\",\"\",Vorgaben!$D$3&\" / \")&IF(Vorgaben!$F$3=\"\",\"\",IF(Vorgaben!$B$6=\"\",Vorgaben!$F$3&\" / \",Vorgaben!$F$3&\" (\"&Vorgaben!$B$6&\") / \"))&IF(Vorgaben!$H$3=\"\",\"\",IF(Vorgaben!$B$6=\"\",Vorgaben!$H$3&\" / \",Vorgaben!$H$3&\" (\"&Vorgaben!$B$6&\") / \"))&IF(Vorgaben!$D$8=\"\",\"\",IF(Vorgaben!$B$6=\"\",Vorgaben!$D$8,Vorgaben!$D$7&\" (\"&Vorgaben!$B$6&\")\")))","v":""},{"$f":"IF(OR($A44=\"\",Vorgaben!$H14=\"\"),\"\",Vorgaben!$H14)","v":""},{"$f":"IF(OR($A44=\"\",Vorgaben!$I$7=\"\"),\"\",$E$2)","v":""},{"$f":"IF(OR($A44=\"\",Vorgaben!$I$7=\"\"),\"\",\"editingteacher\")","v":""},{"$f":"IF(OR($A44=\"\",Vorgaben!$I$7=\"\"),\"\",Vorgaben!$I$7)","v":""},{"$f":"IF(OR($A44=\"\",Vorgaben!$I$14=\"\"),\"\",\"self\")","v":""},{"$f":"IF(OR($A44=\"\",Vorgaben!$I$14=\"\"),\"\",\"student\")","v":""},{"$f":"IF(OR($A44=\"\",Vorgaben!$I$14=\"\"),\"\",Vorgaben!$I$14)","v":""}]
[{"$f":"IF(OR(Vorgaben!$D$8=\"\",Vorgaben!$G15=\"\"),\"\",IF(Vorgaben!$B$6=\"\",Vorgaben!$D$8&\" \"&Vorgaben!$G15,Vorgaben!$B$6&\" \"&Vorgaben!$D$8&\" \"&Vorgaben!$G15))","v":""},"",{"$f":"IF(A28=\"\",\"\",IF(Vorgaben!$B$3=\"\",\"\",Vorgaben!$B$3&\" / \")&IF(Vorgaben!$D$3=\"\",\"\",Vorgaben!$D$3&\" / \")&IF(Vorgaben!$F$3=\"\",\"\",IF(Vorgaben!$B$6=\"\",Vorgaben!$F$3&\" / \",Vorgaben!$F$3&\" (\"&Vorgaben!$B$6&\") / \"))&IF(Vorgaben!$H$3=\"\",\"\",IF(Vorgaben!$B$6=\"\",Vorgaben!$H$3&\" / \",Vorgaben!$H$3&\" (\"&Vorgaben!$B$6&\") / \"))&IF(Vorgaben!$D$8=\"\",\"\",IF(Vorgaben!$B$6=\"\",Vorgaben!$D$8,Vorgaben!$D$7&\" (\"&Vorgaben!$B$6&\")\")))","v":""},{"$f":"IF(OR($A45=\"\",Vorgaben!$H15=\"\"),\"\",Vorgaben!$H15)","v":""},{"$f":"IF(OR($A45=\"\",Vorgaben!$I$7=\"\"),\"\",$E$2)","v":""},{"$f":"IF(OR($A45=\"\",Vorgaben!$I$7=\"\"),\"\",\"editingteacher\")","v":""},{"$f":"IF(OR($A45=\"\",Vorgaben!$I$7=\"\"),\"\",Vorgaben!$I$7)","v":""},{"$f":"IF(OR($A45=\"\",Vorgaben!$I$14=\"\"),\"\",\"self\")","v":""},{"$f":"IF(OR($A45=\"\",Vorgaben!$I$14=\"\"),\"\",\"student\")","v":""},{"$f":"IF(OR($A45=\"\",Vorgaben!$I$14=\"\"),\"\",Vorgaben!$I$14)","v":""}]
[{"$f":"IF(OR(Vorgaben!$D$8=\"\",Vorgaben!$G16=\"\"),\"\",IF(Vorgaben!$B$6=\"\",Vorgaben!$D$8&\" \"&Vorgaben!$G16,Vorgaben!$B$6&\" \"&Vorgaben!$D$8&\" \"&Vorgaben!$G16))","v":""},"",{"$f":"IF(A29=\"\",\"\",IF(Vorgaben!$B$3=\"\",\"\",Vorgaben!$B$3&\" / \")&IF(Vorgaben!$D$3=\"\",\"\",Vorgaben!$D$3&\" / \")&IF(Vorgaben!$F$3=\"\",\"\",IF(Vorgaben!$B$6=\"\",Vorgaben!$F$3&\" / \",Vorgaben!$F$3&\" (\"&Vorgaben!$B$6&\") / \"))&IF(Vorgaben!$H$3=\"\",\"\",IF(Vorgaben!$B$6=\"\",Vorgaben!$H$3&\" / \",Vorgaben!$H$3&\" (\"&Vorgaben!$B$6&\") / \"))&IF(Vorgaben!$D$8=\"\",\"\",IF(Vorgaben!$B$6=\"\",Vorgaben!$D$8,Vorgaben!$D$7&\" (\"&Vorgaben!$B$6&\")\")))","v":""},{"$f":"IF(OR($A46=\"\",Vorgaben!$H16=\"\"),\"\",Vorgaben!$H16)","v":""},{"$f":"IF(OR($A46=\"\",Vorgaben!$I$7=\"\"),\"\",$E$2)","v":""},{"$f":"IF(OR($A46=\"\",Vorgaben!$I$7=\"\"),\"\",\"editingteacher\")","v":""},{"$f":"IF(OR($A46=\"\",Vorgaben!$I$7=\"\"),\"\",Vorgaben!$I$7)","v":""},{"$f":"IF(OR($A46=\"\",Vorgaben!$I$14=\"\"),\"\",\"self\")","v":""},{"$f":"IF(OR($A46=\"\",Vorgaben!$I$14=\"\"),\"\",\"student\")","v":""},{"$f":"IF(OR($A46=\"\",Vorgaben!$I$14=\"\"),\"\",Vorgaben!$I$14)","v":""}]
[{"$f":"IF(OR(Vorgaben!$D$8=\"\",Vorgaben!$G17=\"\"),\"\",IF(Vorgaben!$B$6=\"\",Vorgaben!$D$8&\" \"&Vorgaben!$G17,Vorgaben!$B$6&\" \"&Vorgaben!$D$8&\" \"&Vorgaben!$G17))","v":""},"",{"$f":"IF(A30=\"\",\"\",IF(Vorgaben!$B$3=\"\",\"\",Vorgaben!$B$3&\" / \")&IF(Vorgaben!$D$3=\"\",\"\",Vorgaben!$D$3&\" / \")&IF(Vorgaben!$F$3=\"\",\"\",IF(Vorgaben!$B$6=\"\",Vorgaben!$F$3&\" / \",Vorgaben!$F$3&\" (\"&Vorgaben!$B$6&\") / \"))&IF(Vorgaben!$H$3=\"\",\"\",IF(Vorgaben!$B$6=\"\",Vorgaben!$H$3&\" / \",Vorgaben!$H$3&\" (\"&Vorgaben!$B$6&\") / \"))&IF(Vorgaben!$D$8=\"\",\"\",IF(Vorgaben!$B$6=\"\",Vorgaben!$D$8,Vorgaben!$D$7&\" (\"&Vorgaben!$B$6&\")\")))","v":""},{"$f":"IF(OR($A47=\"\",Vorgaben!$H17=\"\"),\"\",Vorgaben!$H17)","v":""},{"$f":"IF(OR($A47=\"\",Vorgaben!$I$7=\"\"),\"\",$E$2)","v":""},{"$f":"IF(OR($A47=\"\",Vorgaben!$I$7=\"\"),\"\",\"editingteacher\")","v":""},{"$f":"IF(OR($A47=\"\",Vorgaben!$I$7=\"\"),\"\",Vorgaben!$I$7)","v":""},{"$f":"IF(OR($A47=\"\",Vorgaben!$I$14=\"\"),\"\",\"self\")","v":""},{"$f":"IF(OR($A47=\"\",Vorgaben!$I$14=\"\"),\"\",\"student\")","v":""},{"$f":"IF(OR($A47=\"\",Vorgaben!$I$14=\"\"),\"\",Vorgaben!$I$14)","v":""}]
[{"$f":"IF(OR(Vorgaben!$D$8=\"\",Vorgaben!$G18=\"\"),\"\",IF(Vorgaben!$B$6=\"\",Vorgaben!$D$8&\" \"&Vorgaben!$G18,Vorgaben!$B$6&\" \"&Vorgaben!$D$8&\" \"&Vorgaben!$G18))","v":""},"",{"$f":"IF(A31=\"\",\"\",IF(Vorgaben!$B$3=\"\",\"\",Vorgaben!$B$3&\" / \")&IF(Vorgaben!$D$3=\"\",\"\",Vorgaben!$D$3&\" / \")&IF(Vorgaben!$F$3=\"\",\"\",IF(Vorgaben!$B$6=\"\",Vorgaben!$F$3&\" / \",Vorgaben!$F$3&\" (\"&Vorgaben!$B$6&\") / \"))&IF(Vorgaben!$H$3=\"\",\"\",IF(Vorgaben!$B$6=\"\",Vorgaben!$H$3&\" / \",Vorgaben!$H$3&\" (\"&Vorgaben!$B$6&\") / \"))&IF(Vorgaben!$D$8=\"\",\"\",IF(Vorgaben!$B$6=\"\",Vorgaben!$D$8,Vorgaben!$D$7&\" (\"&Vorgaben!$B$6&\")\")))","v":""},{"$f":"IF(OR($A48=\"\",Vorgaben!$H18=\"\"),\"\",Vorgaben!$H18)","v":""},{"$f":"IF(OR($A48=\"\",Vorgaben!$I$7=\"\"),\"\",$E$2)","v":""},{"$f":"IF(OR($A48=\"\",Vorgaben!$I$7=\"\"),\"\",\"editingteacher\")","v":""},{"$f":"IF(OR($A48=\"\",Vorgaben!$I$7=\"\"),\"\",Vorgaben!$I$7)","v":""},{"$f":"IF(OR($A48=\"\",Vorgaben!$I$14=\"\"),\"\",\"self\")","v":""},{"$f":"IF(OR($A48=\"\",Vorgaben!$I$14=\"\"),\"\",\"student\")","v":""},{"$f":"IF(OR($A48=\"\",Vorgaben!$I$14=\"\"),\"\",Vorgaben!$I$14)","v":""}]
[{"$f":"IF(OR(Vorgaben!$D$8=\"\",Vorgaben!$G19=\"\"),\"\",IF(Vorgaben!$B$6=\"\",Vorgaben!$D$8&\" \"&Vorgaben!$G19,Vorgaben!$B$6&\" \"&Vorgaben!$D$8&\" \"&Vorgaben!$G19))","v":""},"",{"$f":"IF(A32=\"\",\"\",IF(Vorgaben!$B$3=\"\",\"\",Vorgaben!$B$3&\" / \")&IF(Vorgaben!$D$3=\"\",\"\",Vorgaben!$D$3&\" / \")&IF(Vorgaben!$F$3=\"\",\"\",IF(Vorgaben!$B$6=\"\",Vorgaben!$F$3&\" / \",Vorgaben!$F$3&\" (\"&Vorgaben!$B$6&\") / \"))&IF(Vorgaben!$H$3=\"\",\"\",IF(Vorgaben!$B$6=\"\",Vorgaben!$H$3&\" / \",Vorgaben!$H$3&\" (\"&Vorgaben!$B$6&\") / \"))&IF(Vorgaben!$D$8=\"\",\"\",IF(Vorgaben!$B$6=\"\",Vorgaben!$D$8,Vorgaben!$D$7&\" (\"&Vorgaben!$B$6&\")\")))","v":""},{"$f":"IF(OR($A49=\"\",Vorgaben!$H19=\"\"),\"\",Vorgaben!$H19)","v":""},{"$f":"IF(OR($A49=\"\",Vorgaben!$I$7=\"\"),\"\",$E$2)","v":""},{"$f":"IF(OR($A49=\"\",Vorgaben!$I$7=\"\"),\"\",\"editingteacher\")","v":""},{"$f":"IF(OR($A49=\"\",Vorgaben!$I$7=\"\"),\"\",Vorgaben!$I$7)","v":""},{"$f":"IF(OR($A49=\"\",Vorgaben!$I$14=\"\"),\"\",\"self\")","v":""},{"$f":"IF(OR($A49=\"\",Vorgaben!$I$14=\"\"),\"\",\"student\")","v":""},{"$f":"IF(OR($A49=\"\",Vorgaben!$I$14=\"\"),\"\",Vorgaben!$I$14)","v":""}]
[{"$f":"IF(OR(Vorgaben!$D$8=\"\",Vorgaben!$G20=\"\"),\"\",IF(Vorgaben!$B$6=\"\",Vorgaben!$D$8&\" \"&Vorgaben!$G20,Vorgaben!$B$6&\" \"&Vorgaben!$D$8&\" \"&Vorgaben!$G20))","v":""},"",{"$f":"IF(A33=\"\",\"\",IF(Vorgaben!$B$3=\"\",\"\",Vorgaben!$B$3&\" / \")&IF(Vorgaben!$D$3=\"\",\"\",Vorgaben!$D$3&\" / \")&IF(Vorgaben!$F$3=\"\",\"\",IF(Vorgaben!$B$6=\"\",Vorgaben!$F$3&\" / \",Vorgaben!$F$3&\" (\"&Vorgaben!$B$6&\") / \"))&IF(Vorgaben!$H$3=\"\",\"\",IF(Vorgaben!$B$6=\"\",Vorgaben!$H$3&\" / \",Vorgaben!$H$3&\" (\"&Vorgaben!$B$6&\") / \"))&IF(Vorgaben!$D$8=\"\",\"\",IF(Vorgaben!$B$6=\"\",Vorgaben!$D$8,Vorgaben!$D$7&\" (\"&Vorgaben!$B$6&\")\")))","v":""},{"$f":"IF(OR($A50=\"\",Vorgaben!$H20=\"\"),\"\",Vorgaben!$H20)","v":""},{"$f":"IF(OR($A50=\"\",Vorgaben!$I$7=\"\"),\"\",$E$2)","v":""},{"$f":"IF(OR($A50=\"\",Vorgaben!$I$7=\"\"),\"\",\"editingteacher\")","v":""},{"$f":"IF(OR($A50=\"\",Vorgaben!$I$7=\"\"),\"\",Vorgaben!$I$7)","v":""},{"$f":"IF(OR($A50=\"\",Vorgaben!$I$14=\"\"),\"\",\"self\")","v":""},{"$f":"IF(OR($A50=\"\",Vorgaben!$I$14=\"\"),\"\",\"student\")","v":""},{"$f":"IF(OR($A50=\"\",Vorgaben!$I$14=\"\"),\"\",Vorgaben!$I$14)","v":""}]
[{"$f":"IF(OR(Vorgaben!$D$8=\"\",Vorgaben!$G21=\"\"),\"\",IF(Vorgaben!$B$6=\"\",Vorgaben!$D$8&\" \"&Vorgaben!$G21,Vorgaben!$B$6&\" \"&Vorgaben!$D$8&\" \"&Vorgaben!$G21))","v":""},"",{"$f":"IF(A34=\"\",\"\",IF(Vorgaben!$B$3=\"\",\"\",Vorgaben!$B$3&\" / \")&IF(Vorgaben!$D$3=\"\",\"\",Vorgaben!$D$3&\" / \")&IF(Vorgaben!$F$3=\"\",\"\",IF(Vorgaben!$B$6=\"\",Vorgaben!$F$3&\" / \",Vorgaben!$F$3&\" (\"&Vorgaben!$B$6&\") / \"))&IF(Vorgaben!$H$3=\"\",\"\",IF(Vorgaben!$B$6=\"\",Vorgaben!$H$3&\" / \",Vorgaben!$H$3&\" (\"&Vorgaben!$B$6&\") / \"))&IF(Vorgaben!$D$8=\"\",\"\",IF(Vorgaben!$B$6=\"\",Vorgaben!$D$8,Vorgaben!$D$7&\" (\"&Vorgaben!$B$6&\")\")))","v":""},{"$f":"IF(OR($A51=\"\",Vorgaben!$H21=\"\"),\"\",Vorgaben!$H21)","v":""},{"$f":"IF(OR($A51=\"\",Vorgaben!$I$7=\"\"),\"\",$E$2)","v":""},{"$f":"IF(OR($A51=\"\",Vorgaben!$I$7=\"\"),\"\",\"editingteacher\")","v":""},{"$f":"IF(OR($A51=\"\",Vorgaben!$I$7=\"\"),\"\",Vorgaben!$I$7)","v":""},{"$f":"IF(OR($A51=\"\",Vorgaben!$I$14=\"\"),\"\",\"self\")","v":""},{"$f":"IF(OR($A51=\"\",Vorgaben!$I$14=\"\"),\"\",\"student\")","v":""},{"$f":"IF(OR($A51=\"\",Vorgaben!$I$14=\"\"),\"\",Vorgaben!$I$14)","v":""}]

{"sheet":"Diffkurse","index":2,"n_rows":31,"n_cols":10,"rows_kept":31,"cut":false,"hidden":false,"merged":[]}
["shortname","fullname","category_path","templatecourse","enrolment_1","enrolment_1_role","enrolment_1_password","enrolement_2","enrolement_2_role","enrolement_2_passwort"]
[{"$f":"IF(Vorgaben!$K6=\"\",\"\",IF(Vorgaben!$B$6=\"\",Vorgaben!$K6,Vorgaben!$B$6&\" Stufe \"&Vorgaben!$B$9&\" \"&Vorgaben!$K6))","v":"2020-21 Stufe 05 Ev. Religion 1"},{"$f":"A2","v":"2020-21 Stufe 05 Ev. Religion 1"},{"$f":"IF(Vorgaben!K6=\"\",\"\",IF(Vorgaben!$B$3=\"\",\"\",Vorgaben!$B$3&\" / \")&IF(Vorgaben!$D$3=\"\",\"\",Vorgaben!$D$3&\" / \")&IF(Vorgaben!$F$3=\"\",\"\",IF(Vorgaben!$B$6=\"\",Vorgaben!$F$3&\" / \",Vorgaben!$F$3&\" (\"&Vorgaben!$B$6&\") / \"))&IF(Vorgaben!$H$3=\"\",\"\",IF(Vorgaben!$B$6=\"\",Vorgaben!$H$3,Vorgaben!$H$3&\" (\"&Vorgaben!$B$6)&\")\"))","v":"Unterricht / 2020-21 / Stufe 05 (2020-21) / "},{"$f":"IF(OR($A2=\"\",Vorgaben!$L6=\"\"),\"\",Vorgaben!$L6)","v":"VorlageFach"},{"$f":"IF(OR($A2=\"\",Vorgaben!$M$7=\"\"),\"\",\"self\")","v":"self"},{"$f":"IF(OR($A2=\"\",Vorgaben!$M$7=\"\"),\"\",\"editingteacher\")","v":"editingteacher"},{"$f":"IF(OR($A2=\"\",Vorgaben!$M$7=\"\"),\"\",Vorgaben!$M$7)","v":"djv5456+"},{"$f":"IF(OR($A2=\"\",Vorgaben!$N$6=\"\"),\"\",\"self\")","v":""},{"$f":"IF(OR($A2=\"\",Vorgaben!$N$6=\"\"),\"\",\"student\")","v":""},{"$f":"IF(OR($A2=\"\",Vorgaben!$N6=\"\"),\"\",Vorgaben!$N6)","v":""}]
[{"$f":"IF(Vorgaben!$K7=\"\",\"\",IF(Vorgaben!$B$6=\"\",Vorgaben!$K7,Vorgaben!$B$6&\" Stufe \"&Vorgaben!$B$9&\" \"&Vorgaben!$K7))","v":"2020-21 Stufe 05 Kath. Religion 1"},{"$f":"A3","v":"2020-21 Stufe 05 Kath. Religion 1"},{"$f":"IF(Vorgaben!K7=\"\",\"\",IF(Vorgaben!$B$3=\"\",\"\",Vorgaben!$B$3&\" / \")&IF(Vorgaben!$D$3=\"\",\"\",Vorgaben!$D$3&\" / \")&IF(Vorgaben!$F$3=\"\",\"\",IF(Vorgaben!$B$6=\"\",Vorgaben!$F$3&\" / \",Vorgaben!$F$3&\" (\"&Vorgaben!$B$6&\") / \"))&IF(Vorgaben!$H$3=\"\",\"\",IF(Vorgaben!$B$6=\"\",Vorgaben!$H$3,Vorgaben!$H$3&\" (\"&Vorgaben!$B$6)&\")\"))","v":"Unterricht / 2020-21 / Stufe 05 (2020-21) / "},{"$f":"IF(OR($A3=\"\",Vorgaben!$L7=\"\"),\"\",Vorgaben!$L7)","v":"VorlageFach"},{"$f":"IF(OR($A3=\"\",Vorgaben!$M$7=\"\"),\"\",\"self\")","v":"self"},{"$f":"IF(OR($A3=\"\",Vorgaben!$M$7=\"\"),\"\",\"editingteacher\")","v":"editingteacher"},{"$f":"IF(OR($A3=\"\",Vorgaben!$M$7=\"\"),\"\",Vorgaben!$M$7)","v":"djv5456+"},{"$f":"IF(OR($A3=\"\",Vorgaben!$N7=\"\"),\"\",\"self\")","v":""},{"$f":"IF(OR($A3=\"\",Vorgaben!$N7=\"\"),\"\",\"student\")","v":""},{"$f":"IF(OR($A3=\"\",Vorgaben!$N7=\"\"),\"\",Vorgaben!$N7)","v":""}]
[{"$f":"IF(Vorgaben!$K8=\"\",\"\",IF(Vorgaben!$B$6=\"\",Vorgaben!$K8,Vorgaben!$B$6&\" Stufe \"&Vorgaben!$B$9&\" \"&Vorgaben!$K8))","v":"2020-21 Stufe 05 PPL 1"},"2020-21 Stufe 05 PPL 1",{"$f":"IF(Vorgaben!K8=\"\",\"\",IF(Vorgaben!$B$3=\"\",\"\",Vorgaben!$B$3&\" / \")&IF(Vorgaben!$D$3=\"\",\"\",Vorgaben!$D$3&\" / \")&IF(Vorgaben!$F$3=\"\",\"\",IF(Vorgaben!$B$6=\"\",Vorgaben!$F$3&\" / \",Vorgaben!$F$3&\" (\"&Vorgaben!$B$6&\") / \"))&IF(Vorgaben!$H$3=\"\",\"\",IF(Vorgaben!$B$6=\"\",Vorgaben!$H$3,Vorgaben!$H$3&\" (\"&Vorgaben!$B$6)&\")\"))","v":"Unterricht / 2020-21 / Stufe 05 (2020-21) / "},{"$f":"IF(OR($A4=\"\",Vorgaben!$L8=\"\"),\"\",Vorgaben!$L8)","v":"VorlageFach"},{"$f":"IF(OR($A4=\"\",Vorgaben!$M$7=\"\"),\"\",\"self\")","v":"self"},{"$f":"IF(OR($A4=\"\",Vorgaben!$M$7=\"\"),\"\",\"editingteacher\")","v":"editingteacher"},{"$f":"IF(OR($A4=\"\",Vorgaben!$M$7=\"\"),\"\",Vorgaben!$M$7)","v":"djv5456+"},{"$f":"IF(OR($A4=\"\",Vorgaben!$N8=\"\"),\"\",\"self\")","v":""},{"$f":"IF(OR($A4=\"\",Vorgaben!$N8=\"\"),\"\",\"student\")","v":""},{"$f":"IF(OR($A4=\"\",Vorgaben!$N8=\"\"),\"\",Vorgaben!$N8)","v":""}]
[{"$f":"IF(Vorgaben!$K9=\"\",\"\",IF(Vorgaben!$B$6=\"\",Vorgaben!$K9,Vorgaben!$B$6&\" Stufe \"&Vorgaben!$B$9&\" \"&Vorgaben!$K9))","v":""},"",{"$f":"IF(Vorgaben!K9=\"\",\"\",IF(Vorgaben!$B$3=\"\",\"\",Vorgaben!$B$3&\" / \")&IF(Vorgaben!$D$3=\"\",\"\",Vorgaben!$D$3&\" / \")&IF(Vorgaben!$F$3=\"\",\"\",IF(Vorgaben!$B$6=\"\",Vorgaben!$F$3&\" / \",Vorgaben!$F$3&\" (\"&Vorgaben!$B$6&\") / \"))&IF(Vorgaben!$H$3=\"\",\"\",IF(Vorgaben!$B$6=\"\",Vorgaben!$H$3,Vorgaben!$H$3&\" (\"&Vorgaben!$B$6)&\")\"))","v":""},{"$f":"IF(OR($A5=\"\",Vorgaben!$L9=\"\"),\"\",Vorgaben!$L9)","v":""},{"$f":"IF(OR($A5=\"\",Vorgaben!$M$7=\"\"),\"\",\"self\")","v":""},{"$f":"IF(OR($A5=\"\",Vorgaben!$M$7=\"\"),\"\",\"editingteacher\")","v":""},{"$f":"IF(OR($A5=\"\",Vorgaben!$M$7=\"\"),\"\",Vorgaben!$M$7)","v":""},{"$f":"IF(OR($A5=\"\",Vorgaben!$N9=\"\"),\"\",\"self\")","v":""},{"$f":"IF(OR($A5=\"\",Vorgaben!$N9=\"\"),\"\",\"student\")","v":""},{"$f":"IF(OR($A5=\"\",Vorgaben!$N9=\"\"),\"\",Vorgaben!$N9)","v":""}]
[{"$f":"IF(Vorgaben!$K10=\"\",\"\",IF(Vorgaben!$B$6=\"\",Vorgaben!$K10,Vorgaben!$B$6&\" Stufe \"&Vorgaben!$B$9&\" \"&Vorgaben!$K10))","v":""},"",{"$f":"IF(Vorgaben!K10=\"\",\"\",IF(Vorgaben!$B$3=\"\",\"\",Vorgaben!$B$3&\" / \")&IF(Vorgaben!$D$3=\"\",\"\",Vorgaben!$D$3&\" / \")&IF(Vorgaben!$F$3=\"\",\"\",IF(Vorgaben!$B$6=\"\",Vorgaben!$F$3&\" / \",Vorgaben!$F$3&\" (\"&Vorgaben!$B$6&\") / \"))&IF(Vorgaben!$H$3=\"\",\"\",IF(Vorgaben!$B$6=\"\",Vorgaben!$H$3,Vorgaben!$H$3&\" (\"&Vorgaben!$B$6)&\")\"))","v":""},{"$f":"IF(OR($A6=\"\",Vorgaben!$L10=\"\"),\"\",Vorgaben!$L10)","v":""},{"$f":"IF(OR($A6=\"\",Vorgaben!$M$7=\"\"),\"\",\"self\")","v":""},{"$f":"IF(OR($A6=\"\",Vorgaben!$M$7=\"\"),\"\",\"editingteacher\")","v":""},{"$f":"IF(OR($A6=\"\",Vorgaben!$M$7=\"\"),\"\",Vorgaben!$M$7)","v":""},{"$f":"IF(OR($A6=\"\",Vorgaben!$N10=\"\"),\"\",\"self\")","v":""},{"$f":"IF(OR($A6=\"\",Vorgaben!$N10=\"\"),\"\",\"student\")","v":""},{"$f":"IF(OR($A6=\"\",Vorgaben!$N10=\"\"),\"\",Vorgaben!$N10)","v":""}]
[{"$f":"IF(Vorgaben!$K11=\"\",\"\",IF(Vorgaben!$B$6=\"\",Vorgaben!$K11,Vorgaben!$B$6&\" Stufe \"&Vorgaben!$B$9&\" \"&Vorgaben!$K11))","v":""},"",{"$f":"IF(Vorgaben!K11=\"\",\"\",IF(Vorgaben!$B$3=\"\",\"\",Vorgaben!$B$3&\" / \")&IF(Vorgaben!$D$3=\"\",\"\",Vorgaben!$D$3&\" / \")&IF(Vorgaben!$F$3=\"\",\"\",IF(Vorgaben!$B$6=\"\",Vorgaben!$F$3&\" / \",Vorgaben!$F$3&\" (\"&Vorgaben!$B$6&\") / \"))&IF(Vorgaben!$H$3=\"\",\"\",IF(Vorgaben!$B$6=\"\",Vorgaben!$H$3,Vorgaben!$H$3&\" (\"&Vorgaben!$B$6)&\")\"))","v":""},{"$f":"IF(OR($A7=\"\",Vorgaben!$L11=\"\"),\"\",Vorgaben!$L11)","v":""},{"$f":"IF(OR($A7=\"\",Vorgaben!$M$7=\"\"),\"\",\"self\")","v":""},{"$f":"IF(OR($A7=\"\",Vorgaben!$M$7=\"\"),\"\",\"editingteacher\")","v":""},{"$f":"IF(OR($A7=\"\",Vorgaben!$M$7=\"\"),\"\",Vorgaben!$M$7)","v":""},{"$f":"IF(OR($A7=\"\",Vorgaben!$N11=\"\"),\"\",\"self\")","v":""},{"$f":"IF(OR($A7=\"\",Vorgaben!$N11=\"\"),\"\",\"student\")","v":""},{"$f":"IF(OR($A7=\"\",Vorgaben!$N11=\"\"),\"\",Vorgaben!$N11)","v":""}]
[{"$f":"IF(Vorgaben!$K12=\"\",\"\",IF(Vorgaben!$B$6=\"\",Vorgaben!$K12,Vorgaben!$B$6&\" Stufe \"&Vorgaben!$B$9&\" \"&Vorgaben!$K12))","v":""},"",{"$f":"IF(Vorgaben!K12=\"\",\"\",IF(Vorgaben!$B$3=\"\",\"\",Vorgaben!$B$3&\" / \")&IF(Vorgaben!$D$3=\"\",\"\",Vorgaben!$D$3&\" / \")&IF(Vorgaben!$F$3=\"\",\"\",IF(Vorgaben!$B$6=\"\",Vorgaben!$F$3&\" / \",Vorgaben!$F$3&\" (\"&Vorgaben!$B$6&\") / \"))&IF(Vorgaben!$H$3=\"\",\"\",IF(Vorgaben!$B$6=\"\",Vorgaben!$H$3,Vorgaben!$H$3&\" (\"&Vorgaben!$B$6)&\")\"))","v":""},{"$f":"IF(OR($A8=\"\",Vorgaben!$L12=\"\"),\"\",Vorgaben!$L12)","v":""},{"$f":"IF(OR($A8=\"\",Vorgaben!$M$7=\"\"),\"\",\"self\")","v":""},{"$f":"IF(OR($A8=\"\",Vorgaben!$M$7=\"\"),\"\",\"editingteacher\")","v":""},{"$f":"IF(OR($A8=\"\",Vorgaben!$M$7=\"\"),\"\",Vorgaben!$M$7)","v":""},{"$f":"IF(OR($A8=\"\",Vorgaben!$N12=\"\"),\"\",\"self\")","v":""},{"$f":"IF(OR($A8=\"\",Vorgaben!$N12=\"\"),\"\",\"student\")","v":""},{"$f":"IF(OR($A8=\"\",Vorgaben!$N12=\"\"),\"\",Vorgaben!$N12)","v":""}]
[{"$f":"IF(Vorgaben!$K13=\"\",\"\",IF(Vorgaben!$B$6=\"\",Vorgaben!$K13,Vorgaben!$B$6&\" Stufe \"&Vorgaben!$B$9&\" \"&Vorgaben!$K13))","v":""},"",{"$f":"IF(Vorgaben!K13=\"\",\"\",IF(Vorgaben!$B$3=\"\",\"\",Vorgaben!$B$3&\" / \")&IF(Vorgaben!$D$3=\"\",\"\",Vorgaben!$D$3&\" / \")&IF(Vorgaben!$F$3=\"\",\"\",IF(Vorgaben!$B$6=\"\",Vorgaben!$F$3&\" / \",Vorgaben!$F$3&\" (\"&Vorgaben!$B$6&\") / \"))&IF(Vorgaben!$H$3=\"\",\"\",IF(Vorgaben!$B$6=\"\",Vorgaben!$H$3,Vorgaben!$H$3&\" (\"&Vorgaben!$B$6)&\")\"))","v":""},{"$f":"IF(OR($A9=\"\",Vorgaben!$L13=\"\"),\"\",Vorgaben!$L13)","v":""},{"$f":"IF(OR($A9=\"\",Vorgaben!$M$7=\"\"),\"\",\"self\")","v":""},{"$f":"IF(OR($A9=\"\",Vorgaben!$M$7=\"\"),\"\",\"editingteacher\")","v":""},{"$f":"IF(OR($A9=\"\",Vorgaben!$M$7=\"\"),\"\",Vorgaben!$M$7)","v":""},{"$f":"IF(OR($A9=\"\",Vorgaben!$N13=\"\"),\"\",\"self\")","v":""},{"$f":"IF(OR($A9=\"\",Vorgaben!$N13=\"\"),\"\",\"student\")","v":""},{"$f":"IF(OR($A9=\"\",Vorgaben!$N13=\"\"),\"\",Vorgaben!$N13)","v":""}]
[{"$f":"IF(Vorgaben!$K14=\"\",\"\",IF(Vorgaben!$B$6=\"\",Vorgaben!$K14,Vorgaben!$B$6&\" Stufe \"&Vorgaben!$B$9&\" \"&Vorgaben!$K14))","v":""},"",{"$f":"IF(Vorgaben!K14=\"\",\"\",IF(Vorgaben!$B$3=\"\",\"\",Vorgaben!$B$3&\" / \")&IF(Vorgaben!$D$3=\"\",\"\",Vorgaben!$D$3&\" / \")&IF(Vorgaben!$F$3=\"\",\"\",IF(Vorgaben!$B$6=\"\",Vorgaben!$F$3&\" / \",Vorgaben!$F$3&\" (\"&Vorgaben!$B$6&\") / \"))&IF(Vorgaben!$H$3=\"\",\"\",IF(Vorgaben!$B$6=\"\",Vorgaben!$H$3,Vorgaben!$H$3&\" (\"&Vorgaben!$B$6)&\")\"))","v":""},{"$f":"IF(OR($A10=\"\",Vorgaben!$L14=\"\"),\"\",Vorgaben!$L14)","v":""},{"$f":"IF(OR($A10=\"\",Vorgaben!$M$7=\"\"),\"\",\"self\")","v":""},{"$f":"IF(OR($A10=\"\",Vorgaben!$M$7=\"\"),\"\",\"editingteacher\")","v":""},{"$f":"IF(OR($A10=\"\",Vorgaben!$M$7=\"\"),\"\",Vorgaben!$M$7)","v":""},{"$f":"IF(OR($A10=\"\",Vorgaben!$N14=\"\"),\"\",\"self\")","v":""},{"$f":"IF(OR($A10=\"\",Vorgaben!$N14=\"\"),\"\",\"student\")","v":""},{"$f":"IF(OR($A10=\"\",Vorgaben!$N14=\"\"),\"\",Vorgaben!$N14)","v":""}]
[{"$f":"IF(Vorgaben!$K15=\"\",\"\",IF(Vorgaben!$B$6=\"\",Vorgaben!$K15,Vorgaben!$B$6&\" Stufe \"&Vorgaben!$B$9&\" \"&Vorgaben!$K15))","v":""},"",{"$f":"IF(Vorgaben!K15=\"\",\"\",IF(Vorgaben!$B$3=\"\",\"\",Vorgaben!$B$3&\" / \")&IF(Vorgaben!$D$3=\"\",\"\",Vorgaben!$D$3&\" / \")&IF(Vorgaben!$F$3=\"\",\"\",IF(Vorgaben!$B$6=\"\",Vorgaben!$F$3&\" / \",Vorgaben!$F$3&\" (\"&Vorgaben!$B$6&\") / \"))&IF(Vorgaben!$H$3=\"\",\"\",IF(Vorgaben!$B$6=\"\",Vorgaben!$H$3,Vorgaben!$H$3&\" (\"&Vorgaben!$B$6)&\")\"))","v":""},{"$f":"IF(OR($A11=\"\",Vorgaben!$L15=\"\"),\"\",Vorgaben!$L15)","v":""},{"$f":"IF(OR($A11=\"\",Vorgaben!$M$7=\"\"),\"\",\"self\")","v":""},{"$f":"IF(OR($A11=\"\",Vorgaben!$M$7=\"\"),\"\",\"editingteacher\")","v":""},{"$f":"IF(OR($A11=\"\",Vorgaben!$M$7=\"\"),\"\",Vorgaben!$M$7)","v":""},{"$f":"IF(OR($A11=\"\",Vorgaben!$N15=\"\"),\"\",\"self\")","v":""},{"$f":"IF(OR($A11=\"\",Vorgaben!$N15=\"\"),\"\",\"student\")","v":""},{"$f":"IF(OR($A11=\"\",Vorgaben!$N15=\"\"),\"\",Vorgaben!$N15)","v":""}]
[{"$f":"IF(Vorgaben!$K16=\"\",\"\",IF(Vorgaben!$B$6=\"\",Vorgaben!$K16,Vorgaben!$B$6&\" Stufe \"&Vorgaben!$B$9&\" \"&Vorgaben!$K16))","v":""},"",{"$f":"IF(Vorgaben!K16=\"\",\"\",IF(Vorgaben!$B$3=\"\",\"\",Vorgaben!$B$3&\" / \")&IF(Vorgaben!$D$3=\"\",\"\",Vorgaben!$D$3&\" / \")&IF(Vorgaben!$F$3=\"\",\"\",IF(Vorgaben!$B$6=\"\",Vorgaben!$F$3&\" / \",Vorgaben!$F$3&\" (\"&Vorgaben!$B$6&\") / \"))&IF(Vorgaben!$H$3=\"\",\"\",IF(Vorgaben!$B$6=\"\",Vorgaben!$H$3,Vorgaben!$H$3&\" (\"&Vorgaben!$B$6)&\")\"))","v":""},{"$f":"IF(OR($A12=\"\",Vorgaben!$L16=\"\"),\"\",Vorgaben!$L16)","v":""},{"$f":"IF(OR($A12=\"\",Vorgaben!$M$7=\"\"),\"\",\"self\")","v":""},{"$f":"IF(OR($A12=\"\",Vorgaben!$M$7=\"\"),\"\",\"editingteacher\")","v":""},{"$f":"IF(OR($A12=\"\",Vorgaben!$M$7=\"\"),\"\",Vorgaben!$M$7)","v":""},{"$f":"IF(OR($A12=\"\",Vorgaben!$N16=\"\"),\"\",\"self\")","v":""},{"$f":"IF(OR($A12=\"\",Vorgaben!$N16=\"\"),\"\",\"student\")","v":""},{"$f":"IF(OR($A12=\"\",Vorgaben!$N16=\"\"),\"\",Vorgaben!$N16)","v":""}]
[{"$f":"IF(Vorgaben!$K17=\"\",\"\",IF(Vorgaben!$B$6=\"\",Vorgaben!$K17,Vorgaben!$B$6&\" Stufe \"&Vorgaben!$B$9&\" \"&Vorgaben!$K17))","v":""},"",{"$f":"IF(Vorgaben!K17=\"\",\"\",IF(Vorgaben!$B$3=\"\",\"\",Vorgaben!$B$3&\" / \")&IF(Vorgaben!$D$3=\"\",\"\",Vorgaben!$D$3&\" / \")&IF(Vorgaben!$F$3=\"\",\"\",IF(Vorgaben!$B$6=\"\",Vorgaben!$F$3&\" / \",Vorgaben!$F$3&\" (\"&Vorgaben!$B$6&\") / \"))&IF(Vorgaben!$H$3=\"\",\"\",IF(Vorgaben!$B$6=\"\",Vorgaben!$H$3,Vorgaben!$H$3&\" (\"&Vorgaben!$B$6)&\")\"))","v":""},{"$f":"IF(OR($A13=\"\",Vorgaben!$L17=\"\"),\"\",Vorgaben!$L17)","v":""},{"$f":"IF(OR($A13=\"\",Vorgaben!$M$7=\"\"),\"\",\"self\")","v":""},{"$f":"IF(OR($A13=\"\",Vorgaben!$M$7=\"\"),\"\",\"editingteacher\")","v":""},{"$f":"IF(OR($A13=\"\",Vorgaben!$M$7=\"\"),\"\",Vorgaben!$M$7)","v":""},{"$f":"IF(OR($A13=\"\",Vorgaben!$N17=\"\"),\"\",\"self\")","v":""},{"$f":"IF(OR($A13=\"\",Vorgaben!$N17=\"\"),\"\",\"student\")","v":""},{"$f":"IF(OR($A13=\"\",Vorgaben!$N17=\"\"),\"\",Vorgaben!$N17)","v":""}]
[{"$f":"IF(Vorgaben!$K18=\"\",\"\",IF(Vorgaben!$B$6=\"\",Vorgaben!$K18,Vorgaben!$B$6&\" Stufe \"&Vorgaben!$B$9&\" \"&Vorgaben!$K18))","v":""},"",{"$f":"IF(Vorgaben!K18=\"\",\"\",IF(Vorgaben!$B$3=\"\",\"\",Vorgaben!$B$3&\" / \")&IF(Vorgaben!$D$3=\"\",\"\",Vorgaben!$D$3&\" / \")&IF(Vorgaben!$F$3=\"\",\"\",IF(Vorgaben!$B$6=\"\",Vorgaben!$F$3&\" / \",Vorgaben!$F$3&\" (\"&Vorgaben!$B$6&\") / \"))&IF(Vorgaben!$H$3=\"\",\"\",IF(Vorgaben!$B$6=\"\",Vorgaben!$H$3,Vorgaben!$H$3&\" (\"&Vorgaben!$B$6)&\")\"))","v":""},{"$f":"IF(OR($A14=\"\",Vorgaben!$L18=\"\"),\"\",Vorgaben!$L18)","v":""},{"$f":"IF(OR($A14=\"\",Vorgaben!$M$7=\"\"),\"\",\"self\")","v":""},{"$f":"IF(OR($A14=\"\",Vorgaben!$M$7=\"\"),\"\",\"editingteacher\")","v":""},{"$f":"IF(OR($A14=\"\",Vorgaben!$M$7=\"\"),\"\",Vorgaben!$M$7)","v":""},{"$f":"IF(OR($A14=\"\",Vorgaben!$N18=\"\"),\"\",\"self\")","v":""},{"$f":"IF(OR($A14=\"\",Vorgaben!$N18=\"\"),\"\",\"student\")","v":""},{"$f":"IF(OR($A14=\"\",Vorgaben!$N18=\"\"),\"\",Vorgaben!$N18)","v":""}]
[{"$f":"IF(Vorgaben!$K19=\"\",\"\",IF(Vorgaben!$B$6=\"\",Vorgaben!$K19,Vorgaben!$B$6&\" Stufe \"&Vorgaben!$B$9&\" \"&Vorgaben!$K19))","v":""},"",{"$f":"IF(Vorgaben!K19=\"\",\"\",IF(Vorgaben!$B$3=\"\",\"\",Vorgaben!$B$3&\" / \")&IF(Vorgaben!$D$3=\"\",\"\",Vorgaben!$D$3&\" / \")&IF(Vorgaben!$F$3=\"\",\"\",IF(Vorgaben!$B$6=\"\",Vorgaben!$F$3&\" / \",Vorgaben!$F$3&\" (\"&Vorgaben!$B$6&\") / \"))&IF(Vorgaben!$H$3=\"\",\"\",IF(Vorgaben!$B$6=\"\",Vorgaben!$H$3,Vorgaben!$H$3&\" (\"&Vorgaben!$B$6)&\")\"))","v":""},{"$f":"IF(OR($A15=\"\",Vorgaben!$L19=\"\"),\"\",Vorgaben!$L19)","v":""},{"$f":"IF(OR($A15=\"\",Vorgaben!$M$7=\"\"),\"\",\"self\")","v":""},{"$f":"IF(OR($A15=\"\",Vorgaben!$M$7=\"\"),\"\",\"editingteacher\")","v":""},{"$f":"IF(OR($A15=\"\",Vorgaben!$M$7=\"\"),\"\",Vorgaben!$M$7)","v":""},{"$f":"IF(OR($A15=\"\",Vorgaben!$N19=\"\"),\"\",\"self\")","v":""},{"$f":"IF(OR($A15=\"\",Vorgaben!$N19=\"\"),\"\",\"student\")","v":""},{"$f":"IF(OR($A15=\"\",Vorgaben!$N19=\"\"),\"\",Vorgaben!$N19)","v":""}]
[{"$f":"IF(Vorgaben!$K20=\"\",\"\",IF(Vorgaben!$B$6=\"\",Vorgaben!$K20,Vorgaben!$B$6&\" Stufe \"&Vorgaben!$B$9&\" \"&Vorgaben!$K20))","v":""},"",{"$f":"IF(Vorgaben!K20=\"\",\"\",IF(Vorgaben!$B$3=\"\",\"\",Vorgaben!$B$3&\" / \")&IF(Vorgaben!$D$3=\"\",\"\",Vorgaben!$D$3&\" / \")&IF(Vorgaben!$F$3=\"\",\"\",IF(Vorgaben!$B$6=\"\",Vorgaben!$F$3&\" / \",Vorgaben!$F$3&\" (\"&Vorgaben!$B$6&\") / \"))&IF(Vorgaben!$H$3=\"\",\"\",IF(Vorgaben!$B$6=\"\",Vorgaben!$H$3,Vorgaben!$H$3&\" (\"&Vorgaben!$B$6)&\")\"))","v":""},{"$f":"IF(OR($A16=\"\",Vorgaben!$L20=\"\"),\"\",Vorgaben!$L20)","v":""},{"$f":"IF(OR($A16=\"\",Vorgaben!$M$7=\"\"),\"\",\"self\")","v":""},{"$f":"IF(OR($A16=\"\",Vorgaben!$M$7=\"\"),\"\",\"editingteacher\")","v":""},{"$f":"IF(OR($A16=\"\",Vorgaben!$M$7=\"\"),\"\",Vorgaben!$M$7)","v":""},{"$f":"IF(OR($A16=\"\",Vorgaben!$N20=\"\"),\"\",\"self\")","v":""},{"$f":"IF(OR($A16=\"\",Vorgaben!$N20=\"\"),\"\",\"student\")","v":""},{"$f":"IF(OR($A16=\"\",Vorgaben!$N20=\"\"),\"\",Vorgaben!$N20)","v":""}]
[{"$f":"IF(Vorgaben!$K21=\"\",\"\",IF(Vorgaben!$B$6=\"\",Vorgaben!$K21,Vorgaben!$B$6&\" Stufe \"&Vorgaben!$B$9&\" \"&Vorgaben!$K21))","v":""},"",{"$f":"IF(Vorgaben!K21=\"\",\"\",IF(Vorgaben!$B$3=\"\",\"\",Vorgaben!$B$3&\" / \")&IF(Vorgaben!$D$3=\"\",\"\",Vorgaben!$D$3&\" / \")&IF(Vorgaben!$F$3=\"\",\"\",IF(Vorgaben!$B$6=\"\",Vorgaben!$F$3&\" / \",Vorgaben!$F$3&\" (\"&Vorgaben!$B$6&\") / \"))&IF(Vorgaben!$H$3=\"\",\"\",IF(Vorgaben!$B$6=\"\",Vorgaben!$H$3,Vorgaben!$H$3&\" (\"&Vorgaben!$B$6)&\")\"))","v":""},{"$f":"IF(OR($A17=\"\",Vorgaben!$L21=\"\"),\"\",Vorgaben!$L21)","v":""},{"$f":"IF(OR($A17=\"\",Vorgaben!$M$7=\"\"),\"\",\"self\")","v":""},{"$f":"IF(OR($A17=\"\",Vorgaben!$M$7=\"\"),\"\",\"editingteacher\")","v":""},{"$f":"IF(OR($A17=\"\",Vorgaben!$M$7=\"\"),\"\",Vorgaben!$M$7)","v":""},{"$f":"IF(OR($A17=\"\",Vorgaben!$N21=\"\"),\"\",\"self\")","v":""},{"$f":"IF(OR($A17=\"\",Vorgaben!$N21=\"\"),\"\",\"student\")","v":""},{"$f":"IF(OR($A17=\"\",Vorgaben!$N21=\"\"),\"\",Vorgaben!$N21)","v":""}]
[{"$f":"IF(Vorgaben!$K22=\"\",\"\",IF(Vorgaben!$B$6=\"\",Vorgaben!$K22,Vorgaben!$B$6&\" Stufe \"&Vorgaben!$B$9&\" \"&Vorgaben!$K22))","v":""},"",{"$f":"IF(Vorgaben!K22=\"\",\"\",IF(Vorgaben!$B$3=\"\",\"\",Vorgaben!$B$3&\" / \")&IF(Vorgaben!$D$3=\"\",\"\",Vorgaben!$D$3&\" / \")&IF(Vorgaben!$F$3=\"\",\"\",IF(Vorgaben!$B$6=\"\",Vorgaben!$F$3&\" / \",Vorgaben!$F$3&\" (\"&Vorgaben!$B$6&\") / \"))&IF(Vorgaben!$H$3=\"\",\"\",IF(Vorgaben!$B$6=\"\",Vorgaben!$H$3,Vorgaben!$H$3&\" (\"&Vorgaben!$B$6)&\")\"))","v":""},{"$f":"IF(OR($A18=\"\",Vorgaben!$L22=\"\"),\"\",Vorgaben!$L22)","v":""},{"$f":"IF(OR($A18=\"\",Vorgaben!$M$7=\"\"),\"\",\"self\")","v":""},{"$f":"IF(OR($A18=\"\",Vorgaben!$M$7=\"\"),\"\",\"editingteacher\")","v":""},{"$f":"IF(OR($A18=\"\",Vorgaben!$M$7=\"\"),\"\",Vorgaben!$M$7)","v":""},{"$f":"IF(OR($A18=\"\",Vorgaben!$N22=\"\"),\"\",\"self\")","v":""},{"$f":"IF(OR($A18=\"\",Vorgaben!$N22=\"\"),\"\",\"student\")","v":""},{"$f":"IF(OR($A18=\"\",Vorgaben!$N22=\"\"),\"\",Vorgaben!$N22)","v":""}]
[{"$f":"IF(Vorgaben!$K23=\"\",\"\",IF(Vorgaben!$B$6=\"\",Vorgaben!$K23,Vorgaben!$B$6&\" Stufe \"&Vorgaben!$B$9&\" \"&Vorgaben!$K23))","v":""},"",{"$f":"IF(Vorgaben!K23=\"\",\"\",IF(Vorgaben!$B$3=\"\",\"\",Vorgaben!$B$3&\" / \")&IF(Vorgaben!$D$3=\"\",\"\",Vorgaben!$D$3&\" / \")&IF(Vorgaben!$F$3=\"\",\"\",IF(Vorgaben!$B$6=\"\",Vorgaben!$F$3&\" / \",Vorgaben!$F$3&\" (\"&Vorgaben!$B$6&\") / \"))&IF(Vorgaben!$H$3=\"\",\"\",IF(Vorgaben!$B$6=\"\",Vorgaben!$H$3,Vorgaben!$H$3&\" (\"&Vorgaben!$B$6)&\")\"))","v":""},{"$f":"IF(OR($A19=\"\",Vorgaben!$L23=\"\"),\"\",Vorgaben!$L23)","v":""},{"$f":"IF(OR($A19=\"\",Vorgaben!$M$7=\"\"),\"\",\"self\")","v":""},{"$f":"IF(OR($A19=\"\",Vorgaben!$M$7=\"\"),\"\",\"editingteacher\")","v":""},{"$f":"IF(OR($A19=\"\",Vorgaben!$M$7=\"\"),\"\",Vorgaben!$M$7)","v":""},{"$f":"IF(OR($A19=\"\",Vorgaben!$N23=\"\"),\"\",\"self\")","v":""},{"$f":"IF(OR($A19=\"\",Vorgaben!$N23=\"\"),\"\",\"student\")","v":""},{"$f":"IF(OR($A19=\"\",Vorgaben!$N23=\"\"),\"\",Vorgaben!$N23)","v":""}]
[{"$f":"IF(Vorgaben!$K24=\"\",\"\",IF(Vorgaben!$B$6=\"\",Vorgaben!$K24,Vorgaben!$B$6&\" Stufe \"&Vorgaben!$B$9&\" \"&Vorgaben!$K24))","v":""},"",{"$f":"IF(Vorgaben!K24=\"\",\"\",IF(Vorgaben!$B$3=\"\",\"\",Vorgaben!$B$3&\" / \")&IF(Vorgaben!$D$3=\"\",\"\",Vorgaben!$D$3&\" / \")&IF(Vorgaben!$F$3=\"\",\"\",IF(Vorgaben!$B$6=\"\",Vorgaben!$F$3&\" / \",Vorgaben!$F$3&\" (\"&Vorgaben!$B$6&\") / \"))&IF(Vorgaben!$H$3=\"\",\"\",IF(Vorgaben!$B$6=\"\",Vorgaben!$H$3,Vorgaben!$H$3&\" (\"&Vorgaben!$B$6)&\")\"))","v":""},{"$f":"IF(OR($A20=\"\",Vorgaben!$L24=\"\"),\"\",Vorgaben!$L24)","v":""},{"$f":"IF(OR($A20=\"\",Vorgaben!$M$7=\"\"),\"\",\"self\")","v":""},{"$f":"IF(OR($A20=\"\",Vorgaben!$M$7=\"\"),\"\",\"editingteacher\")","v":""},{"$f":"IF(OR($A20=\"\",Vorgaben!$M$7=\"\"),\"\",Vorgaben!$M$7)","v":""},{"$f":"IF(OR($A20=\"\",Vorgaben!$N24=\"\"),\"\",\"self\")","v":""},{"$f":"IF(OR($A20=\"\",Vorgaben!$N24=\"\"),\"\",\"student\")","v":""},{"$f":"IF(OR($A20=\"\",Vorgaben!$N24=\"\"),\"\",Vorgaben!$N24)","v":""}]
[{"$f":"IF(Vorgaben!$K25=\"\",\"\",IF(Vorgaben!$B$6=\"\",Vorgaben!$K25,Vorgaben!$B$6&\" Stufe \"&Vorgaben!$B$9&\" \"&Vorgaben!$K25))","v":""},"",{"$f":"IF(Vorgaben!K25=\"\",\"\",IF(Vorgaben!$B$3=\"\",\"\",Vorgaben!$B$3&\" / \")&IF(Vorgaben!$D$3=\"\",\"\",Vorgaben!$D$3&\" / \")&IF(Vorgaben!$F$3=\"\",\"\",IF(Vorgaben!$B$6=\"\",Vorgaben!$F$3&\" / \",Vorgaben!$F$3&\" (\"&Vorgaben!$B$6&\") / \"))&IF(Vorgaben!$H$3=\"\",\"\",IF(Vorgaben!$B$6=\"\",Vorgaben!$H$3,Vorgaben!$H$3&\" (\"&Vorgaben!$B$6)&\")\"))","v":""},{"$f":"IF(OR($A21=\"\",Vorgaben!$L25=\"\"),\"\",Vorgaben!$L25)","v":""},{"$f":"IF(OR($A21=\"\",Vorgaben!$M$7=\"\"),\"\",\"self\")","v":""},{"$f":"IF(OR($A21=\"\",Vorgaben!$M$7=\"\"),\"\",\"editingteacher\")","v":""},{"$f":"IF(OR($A21=\"\",Vorgaben!$M$7=\"\"),\"\",Vorgaben!$M$7)","v":""},{"$f":"IF(OR($A21=\"\",Vorgaben!$N25=\"\"),\"\",\"self\")","v":""},{"$f":"IF(OR($A21=\"\",Vorgaben!$N25=\"\"),\"\",\"student\")","v":""},{"$f":"IF(OR($A21=\"\",Vorgaben!$N25=\"\"),\"\",Vorgaben!$N25)","v":""}]
[{"$f":"IF(Vorgaben!$K26=\"\",\"\",IF(Vorgaben!$B$6=\"\",Vorgaben!$K26,Vorgaben!$B$6&\" Stufe \"&Vorgaben!$B$9&\" \"&Vorgaben!$K26))","v":""},"",{"$f":"IF(Vorgaben!K26=\"\",\"\",IF(Vorgaben!$B$3=\"\",\"\",Vorgaben!$B$3&\" / \")&IF(Vorgaben!$D$3=\"\",\"\",Vorgaben!$D$3&\" / \")&IF(Vorgaben!$F$3=\"\",\"\",IF(Vorgaben!$B$6=\"\",Vorgaben!$F$3&\" / \",Vorgaben!$F$3&\" (\"&Vorgaben!$B$6&\") / \"))&IF(Vorgaben!$H$3=\"\",\"\",IF(Vorgaben!$B$6=\"\",Vorgaben!$H$3,Vorgaben!$H$3&\" (\"&Vorgaben!$B$6)&\")\"))","v":""},{"$f":"IF(OR($A22=\"\",Vorgaben!$L26=\"\"),\"\",Vorgaben!$L26)","v":""},{"$f":"IF(OR($A22=\"\",Vorgaben!$M$7=\"\"),\"\",\"self\")","v":""},{"$f":"IF(OR($A22=\"\",Vorgaben!$M$7=\"\"),\"\",\"editingteacher\")","v":""},{"$f":"IF(OR($A22=\"\",Vorgaben!$M$7=\"\"),\"\",Vorgaben!$M$7)","v":""},{"$f":"IF(OR($A22=\"\",Vorgaben!$N26=\"\"),\"\",\"self\")","v":""},{"$f":"IF(OR($A22=\"\",Vorgaben!$N26=\"\"),\"\",\"student\")","v":""},{"$f":"IF(OR($A22=\"\",Vorgaben!$N26=\"\"),\"\",Vorgaben!$N26)","v":""}]
[{"$f":"IF(Vorgaben!$K27=\"\",\"\",IF(Vorgaben!$B$6=\"\",Vorgaben!$K27,Vorgaben!$B$6&\" Stufe \"&Vorgaben!$B$9&\" \"&Vorgaben!$K27))","v":""},"",{"$f":"IF(Vorgaben!K27=\"\",\"\",IF(Vorgaben!$B$3=\"\",\"\",Vorgaben!$B$3&\" / \")&IF(Vorgaben!$D$3=\"\",\"\",Vorgaben!$D$3&\" / \")&IF(Vorgaben!$F$3=\"\",\"\",IF(Vorgaben!$B$6=\"\",Vorgaben!$F$3&\" / \",Vorgaben!$F$3&\" (\"&Vorgaben!$B$6&\") / \"))&IF(Vorgaben!$H$3=\"\",\"\",IF(Vorgaben!$B$6=\"\",Vorgaben!$H$3,Vorgaben!$H$3&\" (\"&Vorgaben!$B$6)&\")\"))","v":""},{"$f":"IF(OR($A23=\"\",Vorgaben!$L27=\"\"),\"\",Vorgaben!$L27)","v":""},{"$f":"IF(OR($A23=\"\",Vorgaben!$M$7=\"\"),\"\",\"self\")","v":""},{"$f":"IF(OR($A23=\"\",Vorgaben!$M$7=\"\"),\"\",\"editingteacher\")","v":""},{"$f":"IF(OR($A23=\"\",Vorgaben!$M$7=\"\"),\"\",Vorgaben!$M$7)","v":""},{"$f":"IF(OR($A23=\"\",Vorgaben!$N27=\"\"),\"\",\"self\")","v":""},{"$f":"IF(OR($A23=\"\",Vorgaben!$N27=\"\"),\"\",\"student\")","v":""},{"$f":"IF(OR($A23=\"\",Vorgaben!$N27=\"\"),\"\",Vorgaben!$N27)","v":""}]
[{"$f":"IF(Vorgaben!$K28=\"\",\"\",IF(Vorgaben!$B$6=\"\",Vorgaben!$K28,Vorgaben!$B$6&\" Stufe \"&Vorgaben!$B$9&\" \"&Vorgaben!$K28))","v":""},"",{"$f":"IF(Vorgaben!K28=\"\",\"\",IF(Vorgaben!$B$3=\"\",\"\",Vorgaben!$B$3&\" / \")&IF(Vorgaben!$D$3=\"\",\"\",Vorgaben!$D$3&\" / \")&IF(Vorgaben!$F$3=\"\",\"\",IF(Vorgaben!$B$6=\"\",Vorgaben!$F$3&\" / \",Vorgaben!$F$3&\" (\"&Vorgaben!$B$6&\") / \"))&IF(Vorgaben!$H$3=\"\",\"\",IF(Vorgaben!$B$6=\"\",Vorgaben!$H$3,Vorgaben!$H$3&\" (\"&Vorgaben!$B$6)&\")\"))","v":""},{"$f":"IF(OR($A24=\"\",Vorgaben!$L28=\"\"),\"\",Vorgaben!$L28)","v":""},{"$f":"IF(OR($A24=\"\",Vorgaben!$M$7=\"\"),\"\",\"self\")","v":""},{"$f":"IF(OR($A24=\"\",Vorgaben!$M$7=\"\"),\"\",\"editingteacher\")","v":""},{"$f":"IF(OR($A24=\"\",Vorgaben!$M$7=\"\"),\"\",Vorgaben!$M$7)","v":""},{"$f":"IF(OR($A24=\"\",Vorgaben!$N28=\"\"),\"\",\"self\")","v":""},{"$f":"IF(OR($A24=\"\",Vorgaben!$N28=\"\"),\"\",\"student\")","v":""},{"$f":"IF(OR($A24=\"\",Vorgaben!$N28=\"\"),\"\",Vorgaben!$N28)","v":""}]
[{"$f":"IF(Vorgaben!$K29=\"\",\"\",IF(Vorgaben!$B$6=\"\",Vorgaben!$K29,Vorgaben!$B$6&\" Stufe \"&Vorgaben!$B$9&\" \"&Vorgaben!$K29))","v":""},"",{"$f":"IF(Vorgaben!K29=\"\",\"\",IF(Vorgaben!$B$3=\"\",\"\",Vorgaben!$B$3&\" / \")&IF(Vorgaben!$D$3=\"\",\"\",Vorgaben!$D$3&\" / \")&IF(Vorgaben!$F$3=\"\",\"\",IF(Vorgaben!$B$6=\"\",Vorgaben!$F$3&\" / \",Vorgaben!$F$3&\" (\"&Vorgaben!$B$6&\") / \"))&IF(Vorgaben!$H$3=\"\",\"\",IF(Vorgaben!$B$6=\"\",Vorgaben!$H$3,Vorgaben!$H$3&\" (\"&Vorgaben!$B$6)&\")\"))","v":""},{"$f":"IF(OR($A25=\"\",Vorgaben!$L29=\"\"),\"\",Vorgaben!$L29)","v":""},{"$f":"IF(OR($A25=\"\",Vorgaben!$M$7=\"\"),\"\",\"self\")","v":""},{"$f":"IF(OR($A25=\"\",Vorgaben!$M$7=\"\"),\"\",\"editingteacher\")","v":""},{"$f":"IF(OR($A25=\"\",Vorgaben!$M$7=\"\"),\"\",Vorgaben!$M$7)","v":""},{"$f":"IF(OR($A25=\"\",Vorgaben!$N29=\"\"),\"\",\"self\")","v":""},{"$f":"IF(OR($A25=\"\",Vorgaben!$N29=\"\"),\"\",\"student\")","v":""},{"$f":"IF(OR($A25=\"\",Vorgaben!$N29=\"\"),\"\",Vorgaben!$N29)","v":""}]
[{"$f":"IF(Vorgaben!$K30=\"\",\"\",IF(Vorgaben!$B$6=\"\",Vorgaben!$K30,Vorgaben!$B$6&\" Stufe \"&Vorgaben!$B$9&\" \"&Vorgaben!$K30))","v":""},"",{"$f":"IF(Vorgaben!K30=\"\",\"\",IF(Vorgaben!$B$3=\"\",\"\",Vorgaben!$B$3&\" / \")&IF(Vorgaben!$D$3=\"\",\"\",Vorgaben!$D$3&\" / \")&IF(Vorgaben!$F$3=\"\",\"\",IF(Vorgaben!$B$6=\"\",Vorgaben!$F$3&\" / \",Vorgaben!$F$3&\" (\"&Vorgaben!$B$6&\") / \"))&IF(Vorgaben!$H$3=\"\",\"\",IF(Vorgaben!$B$6=\"\",Vorgaben!$H$3,Vorgaben!$H$3&\" (\"&Vorgaben!$B$6)&\")\"))","v":""},{"$f":"IF(OR($A26=\"\",Vorgaben!$L30=\"\"),\"\",Vorgaben!$L30)","v":""},{"$f":"IF(OR($A26=\"\",Vorgaben!$M$7=\"\"),\"\",\"self\")","v":""},{"$f":"IF(OR($A26=\"\",Vorgaben!$M$7=\"\"),\"\",\"editingteacher\")","v":""},{"$f":"IF(OR($A26=\"\",Vorgaben!$M$7=\"\"),\"\",Vorgaben!$M$7)","v":""},{"$f":"IF(OR($A26=\"\",Vorgaben!$N30=\"\"),\"\",\"self\")","v":""},{"$f":"IF(OR($A26=\"\",Vorgaben!$N30=\"\"),\"\",\"student\")","v":""},{"$f":"IF(OR($A26=\"\",Vorgaben!$N30=\"\"),\"\",Vorgaben!$N30)","v":""}]
[{"$f":"IF(Vorgaben!$K31=\"\",\"\",IF(Vorgaben!$B$6=\"\",Vorgaben!$K31,Vorgaben!$B$6&\" Stufe \"&Vorgaben!$B$9&\" \"&Vorgaben!$K31))","v":""},"",{"$f":"IF(Vorgaben!K31=\"\",\"\",IF(Vorgaben!$B$3=\"\",\"\",Vorgaben!$B$3&\" / \")&IF(Vorgaben!$D$3=\"\",\"\",Vorgaben!$D$3&\" / \")&IF(Vorgaben!$F$3=\"\",\"\",IF(Vorgaben!$B$6=\"\",Vorgaben!$F$3&\" / \",Vorgaben!$F$3&\" (\"&Vorgaben!$B$6&\") / \"))&IF(Vorgaben!$H$3=\"\",\"\",IF(Vorgaben!$B$6=\"\",Vorgaben!$H$3,Vorgaben!$H$3&\" (\"&Vorgaben!$B$6)&\")\"))","v":""},{"$f":"IF(OR($A27=\"\",Vorgaben!$L31=\"\"),\"\",Vorgaben!$L31)","v":""},{"$f":"IF(OR($A27=\"\",Vorgaben!$M$7=\"\"),\"\",\"self\")","v":""},{"$f":"IF(OR($A27=\"\",Vorgaben!$M$7=\"\"),\"\",\"editingteacher\")","v":""},{"$f":"IF(OR($A27=\"\",Vorgaben!$M$7=\"\"),\"\",Vorgaben!$M$7)","v":""},{"$f":"IF(OR($A27=\"\",Vorgaben!$N31=\"\"),\"\",\"self\")","v":""},{"$f":"IF(OR($A27=\"\",Vorgaben!$N31=\"\"),\"\",\"student\")","v":""},{"$f":"IF(OR($A27=\"\",Vorgaben!$N31=\"\"),\"\",Vorgaben!$N31)","v":""}]
[{"$f":"IF(Vorgaben!$K32=\"\",\"\",IF(Vorgaben!$B$6=\"\",Vorgaben!$K32,Vorgaben!$B$6&\" Stufe \"&Vorgaben!$B$9&\" \"&Vorgaben!$K32))","v":""},"",{"$f":"IF(Vorgaben!K32=\"\",\"\",IF(Vorgaben!$B$3=\"\",\"\",Vorgaben!$B$3&\" / \")&IF(Vorgaben!$D$3=\"\",\"\",Vorgaben!$D$3&\" / \")&IF(Vorgaben!$F$3=\"\",\"\",IF(Vorgaben!$B$6=\"\",Vorgaben!$F$3&\" / \",Vorgaben!$F$3&\" (\"&Vorgaben!$B$6&\") / \"))&IF(Vorgaben!$H$3=\"\",\"\",IF(Vorgaben!$B$6=\"\",Vorgaben!$H$3,Vorgaben!$H$3&\" (\"&Vorgaben!$B$6)&\")\"))","v":""},{"$f":"IF(OR($A28=\"\",Vorgaben!$L32=\"\"),\"\",Vorgaben!$L32)","v":""},{"$f":"IF(OR($A28=\"\",Vorgaben!$M$7=\"\"),\"\",\"self\")","v":""},{"$f":"IF(OR($A28=\"\",Vorgaben!$M$7=\"\"),\"\",\"editingteacher\")","v":""},{"$f":"IF(OR($A28=\"\",Vorgaben!$M$7=\"\"),\"\",Vorgaben!$M$7)","v":""},{"$f":"IF(OR($A28=\"\",Vorgaben!$N32=\"\"),\"\",\"self\")","v":""},{"$f":"IF(OR($A28=\"\",Vorgaben!$N32=\"\"),\"\",\"student\")","v":""},{"$f":"IF(OR($A28=\"\",Vorgaben!$N32=\"\"),\"\",Vorgaben!$N32)","v":""}]
[{"$f":"IF(Vorgaben!$K33=\"\",\"\",IF(Vorgaben!$B$6=\"\",Vorgaben!$K33,Vorgaben!$B$6&\" Stufe \"&Vorgaben!$B$9&\" \"&Vorgaben!$K33))","v":""},"",{"$f":"IF(Vorgaben!K33=\"\",\"\",IF(Vorgaben!$B$3=\"\",\"\",Vorgaben!$B$3&\" / \")&IF(Vorgaben!$D$3=\"\",\"\",Vorgaben!$D$3&\" / \")&IF(Vorgaben!$F$3=\"\",\"\",IF(Vorgaben!$B$6=\"\",Vorgaben!$F$3&\" / \",Vorgaben!$F$3&\" (\"&Vorgaben!$B$6&\") / \"))&IF(Vorgaben!$H$3=\"\",\"\",IF(Vorgaben!$B$6=\"\",Vorgaben!$H$3,Vorgaben!$H$3&\" (\"&Vorgaben!$B$6)&\")\"))","v":""},{"$f":"IF(OR($A29=\"\",Vorgaben!$L33=\"\"),\"\",Vorgaben!$L33)","v":""},{"$f":"IF(OR($A29=\"\",Vorgaben!$M$7=\"\"),\"\",\"self\")","v":""},{"$f":"IF(OR($A29=\"\",Vorgaben!$M$7=\"\"),\"\",\"editingteacher\")","v":""},{"$f":"IF(OR($A29=\"\",Vorgaben!$M$7=\"\"),\"\",Vorgaben!$M$7)","v":""},{"$f":"IF(OR($A29=\"\",Vorgaben!$N33=\"\"),\"\",\"self\")","v":""},{"$f":"IF(OR($A29=\"\",Vorgaben!$N33=\"\"),\"\",\"student\")","v":""},{"$f":"IF(OR($A29=\"\",Vorgaben!$N33=\"\"),\"\",Vorgaben!$N33)","v":""}]
[{"$f":"IF(Vorgaben!$K34=\"\",\"\",IF(Vorgaben!$B$6=\"\",Vorgaben!$K34,Vorgaben!$B$6&\" Stufe \"&Vorgaben!$B$9&\" \"&Vorgaben!$K34))","v":""},"",{"$f":"IF(Vorgaben!K34=\"\",\"\",IF(Vorgaben!$B$3=\"\",\"\",Vorgaben!$B$3&\" / \")&IF(Vorgaben!$D$3=\"\",\"\",Vorgaben!$D$3&\" / \")&IF(Vorgaben!$F$3=\"\",\"\",IF(Vorgaben!$B$6=\"\",Vorgaben!$F$3&\" / \",Vorgaben!$F$3&\" (\"&Vorgaben!$B$6&\") / \"))&IF(Vorgaben!$H$3=\"\",\"\",IF(Vorgaben!$B$6=\"\",Vorgaben!$H$3,Vorgaben!$H$3&\" (\"&Vorgaben!$B$6)&\")\"))","v":""},{"$f":"IF(OR($A30=\"\",Vorgaben!$L34=\"\"),\"\",Vorgaben!$L34)","v":""},{"$f":"IF(OR($A30=\"\",Vorgaben!$M$7=\"\"),\"\",\"self\")","v":""},{"$f":"IF(OR($A30=\"\",Vorgaben!$M$7=\"\"),\"\",\"editingteacher\")","v":""},{"$f":"IF(OR($A30=\"\",Vorgaben!$M$7=\"\"),\"\",Vorgaben!$M$7)","v":""},{"$f":"IF(OR($A30=\"\",Vorgaben!$N34=\"\"),\"\",\"self\")","v":""},{"$f":"IF(OR($A30=\"\",Vorgaben!$N34=\"\"),\"\",\"student\")","v":""},{"$f":"IF(OR($A30=\"\",Vorgaben!$N34=\"\"),\"\",Vorgaben!$N34)","v":""}]
[{"$f":"IF(Vorgaben!$K35=\"\",\"\",IF(Vorgaben!$B$6=\"\",Vorgaben!$K35,Vorgaben!$B$6&\" Stufe \"&Vorgaben!$B$9&\" \"&Vorgaben!$K35))","v":""},"",{"$f":"IF(Vorgaben!K35=\"\",\"\",IF(Vorgaben!$B$3=\"\",\"\",Vorgaben!$B$3&\" / \")&IF(Vorgaben!$D$3=\"\",\"\",Vorgaben!$D$3&\" / \")&IF(Vorgaben!$F$3=\"\",\"\",IF(Vorgaben!$B$6=\"\",Vorgaben!$F$3&\" / \",Vorgaben!$F$3&\" (\"&Vorgaben!$B$6&\") / \"))&IF(Vorgaben!$H$3=\"\",\"\",IF(Vorgaben!$B$6=\"\",Vorgaben!$H$3,Vorgaben!$H$3&\" (\"&Vorgaben!$B$6)&\")\"))","v":""},{"$f":"IF(OR($A31=\"\",Vorgaben!$L35=\"\"),\"\",Vorgaben!$L35)","v":""},{"$f":"IF(OR($A31=\"\",Vorgaben!$M$7=\"\"),\"\",\"self\")","v":""},{"$f":"IF(OR($A31=\"\",Vorgaben!$M$7=\"\"),\"\",\"editingteacher\")","v":""},{"$f":"IF(OR($A31=\"\",Vorgaben!$M$7=\"\"),\"\",Vorgaben!$M$7)","v":""},{"$f":"IF(OR($A31=\"\",Vorgaben!$N35=\"\"),\"\",\"self\")","v":""},{"$f":"IF(OR($A31=\"\",Vorgaben!$N35=\"\"),\"\",\"student\")","v":""},{"$f":"IF(OR($A31=\"\",Vorgaben!$N35=\"\"),\"\",Vorgaben!$N35)","v":""}]

{"sheet":"PDF Diffkurse","index":3,"n_rows":32,"n_cols":3,"rows_kept":32,"cut":false,"hidden":false,"merged":[[0,1,0,2]]}
[{"$f":"\"Diffkurse & Ags der Stufe \"&Vorgaben!B9","v":"Diffkurse & Ags der Stufe 05"},"Sind Passwörter angegeben, so wurde der Kurs mit der Möglichkeit der Selbsteinschreibung importiert."]
["Klassenkursname ","Passwort Lehrer/in","Passwort Schüler/in"]
[{"$f":"IF(Vorgaben!$K7=\"\",\"\",Vorgaben!$K7)","v":"Kath. Religion 1"},{"$f":"IF(OR($A3=\"\",Vorgaben!$M$7=\"\"),\"\",Vorgaben!$M$7)","v":"djv5456+"},{"$f":"IF(OR($A3=\"\",Vorgaben!$N7=\"\"),\"\",Vorgaben!$N7)","v":""}]
[{"$f":"IF(Vorgaben!$K8=\"\",\"\",Vorgaben!$K8)","v":"PPL 1"},{"$f":"IF(OR($A4=\"\",Vorgaben!$M$7=\"\"),\"\",Vorgaben!$M$7)","v":"djv5456+"},{"$f":"IF(OR($A4=\"\",Vorgaben!$N8=\"\"),\"\",Vorgaben!$N8)","v":""}]
[{"$f":"IF(Vorgaben!$K9=\"\",\"\",Vorgaben!$K9)","v":""},{"$f":"IF(OR($A5=\"\",Vorgaben!$M$7=\"\"),\"\",Vorgaben!$M$7)","v":""},{"$f":"IF(OR($A5=\"\",Vorgaben!$N9=\"\"),\"\",Vorgaben!$N9)","v":""}]
[{"$f":"IF(Vorgaben!$K10=\"\",\"\",Vorgaben!$K10)","v":""},{"$f":"IF(OR($A6=\"\",Vorgaben!$M$7=\"\"),\"\",Vorgaben!$M$7)","v":""},{"$f":"IF(OR($A6=\"\",Vorgaben!$N10=\"\"),\"\",Vorgaben!$N10)","v":""}]
[{"$f":"IF(Vorgaben!$K11=\"\",\"\",Vorgaben!$K11)","v":""},{"$f":"IF(OR($A7=\"\",Vorgaben!$M$7=\"\"),\"\",Vorgaben!$M$7)","v":""},{"$f":"IF(OR($A7=\"\",Vorgaben!$N11=\"\"),\"\",Vorgaben!$N11)","v":""}]
[{"$f":"IF(Vorgaben!$K12=\"\",\"\",Vorgaben!$K12)","v":""},{"$f":"IF(OR($A8=\"\",Vorgaben!$M$7=\"\"),\"\",Vorgaben!$M$7)","v":""},{"$f":"IF(OR($A8=\"\",Vorgaben!$N12=\"\"),\"\",Vorgaben!$N12)","v":""}]
[{"$f":"IF(Vorgaben!$K13=\"\",\"\",Vorgaben!$K13)","v":""},{"$f":"IF(OR($A9=\"\",Vorgaben!$M$7=\"\"),\"\",Vorgaben!$M$7)","v":""},{"$f":"IF(OR($A9=\"\",Vorgaben!$N13=\"\"),\"\",Vorgaben!$N13)","v":""}]
[{"$f":"IF(Vorgaben!$K14=\"\",\"\",Vorgaben!$K14)","v":""},{"$f":"IF(OR($A10=\"\",Vorgaben!$M$7=\"\"),\"\",Vorgaben!$M$7)","v":""},{"$f":"IF(OR($A10=\"\",Vorgaben!$N14=\"\"),\"\",Vorgaben!$N14)","v":""}]
[{"$f":"IF(Vorgaben!$K15=\"\",\"\",Vorgaben!$K15)","v":""},{"$f":"IF(OR($A11=\"\",Vorgaben!$M$7=\"\"),\"\",Vorgaben!$M$7)","v":""},{"$f":"IF(OR($A11=\"\",Vorgaben!$N15=\"\"),\"\",Vorgaben!$N15)","v":""}]
[{"$f":"IF(Vorgaben!$K16=\"\",\"\",Vorgaben!$K16)","v":""},{"$f":"IF(OR($A12=\"\",Vorgaben!$M$7=\"\"),\"\",Vorgaben!$M$7)","v":""},{"$f":"IF(OR($A12=\"\",Vorgaben!$N16=\"\"),\"\",Vorgaben!$N16)","v":""}]
[{"$f":"IF(Vorgaben!$K17=\"\",\"\",Vorgaben!$K17)","v":""},{"$f":"IF(OR($A13=\"\",Vorgaben!$M$7=\"\"),\"\",Vorgaben!$M$7)","v":""},{"$f":"IF(OR($A13=\"\",Vorgaben!$N17=\"\"),\"\",Vorgaben!$N17)","v":""}]
[{"$f":"IF(Vorgaben!$K18=\"\",\"\",Vorgaben!$K18)","v":""},{"$f":"IF(OR($A14=\"\",Vorgaben!$M$7=\"\"),\"\",Vorgaben!$M$7)","v":""},{"$f":"IF(OR($A14=\"\",Vorgaben!$N18=\"\"),\"\",Vorgaben!$N18)","v":""}]
[{"$f":"IF(Vorgaben!$K19=\"\",\"\",Vorgaben!$K19)","v":""},{"$f":"IF(OR($A15=\"\",Vorgaben!$M$7=\"\"),\"\",Vorgaben!$M$7)","v":""},{"$f":"IF(OR($A15=\"\",Vorgaben!$N19=\"\"),\"\",Vorgaben!$N19)","v":""}]
[{"$f":"IF(Vorgaben!$K20=\"\",\"\",Vorgaben!$K20)","v":""},{"$f":"IF(OR($A16=\"\",Vorgaben!$M$7=\"\"),\"\",Vorgaben!$M$7)","v":""},{"$f":"IF(OR($A16=\"\",Vorgaben!$N20=\"\"),\"\",Vorgaben!$N20)","v":""}]
[{"$f":"IF(Vorgaben!$K21=\"\",\"\",Vorgaben!$K21)","v":""},{"$f":"IF(OR($A17=\"\",Vorgaben!$M$7=\"\"),\"\",Vorgaben!$M$7)","v":""},{"$f":"IF(OR($A17=\"\",Vorgaben!$N21=\"\"),\"\",Vorgaben!$N21)","v":""}]
[{"$f":"IF(Vorgaben!$K22=\"\",\"\",Vorgaben!$K22)","v":""},{"$f":"IF(OR($A18=\"\",Vorgaben!$M$7=\"\"),\"\",Vorgaben!$M$7)","v":""},{"$f":"IF(OR($A18=\"\",Vorgaben!$N22=\"\"),\"\",Vorgaben!$N22)","v":""}]
[{"$f":"IF(Vorgaben!$K23=\"\",\"\",Vorgaben!$K23)","v":""},{"$f":"IF(OR($A19=\"\",Vorgaben!$M$7=\"\"),\"\",Vorgaben!$M$7)","v":""},{"$f":"IF(OR($A19=\"\",Vorgaben!$N23=\"\"),\"\",Vorgaben!$N23)","v":""}]
[{"$f":"IF(Vorgaben!$K24=\"\",\"\",Vorgaben!$K24)","v":""},{"$f":"IF(OR($A20=\"\",Vorgaben!$M$7=\"\"),\"\",Vorgaben!$M$7)","v":""},{"$f":"IF(OR($A20=\"\",Vorgaben!$N24=\"\"),\"\",Vorgaben!$N24)","v":""}]
[{"$f":"IF(Vorgaben!$K25=\"\",\"\",Vorgaben!$K25)","v":""},{"$f":"IF(OR($A21=\"\",Vorgaben!$M$7=\"\"),\"\",Vorgaben!$M$7)","v":""},{"$f":"IF(OR($A21=\"\",Vorgaben!$N25=\"\"),\"\",Vorgaben!$N25)","v":""}]
[{"$f":"IF(Vorgaben!$K26=\"\",\"\",Vorgaben!$K26)","v":""},{"$f":"IF(OR($A22=\"\",Vorgaben!$M$7=\"\"),\"\",Vorgaben!$M$7)","v":""},{"$f":"IF(OR($A22=\"\",Vorgaben!$N26=\"\"),\"\",Vorgaben!$N26)","v":""}]
[{"$f":"IF(Vorgaben!$K27=\"\",\"\",Vorgaben!$K27)","v":""},{"$f":"IF(OR($A23=\"\",Vorgaben!$M$7=\"\"),\"\",Vorgaben!$M$7)","v":""},{"$f":"IF(OR($A23=\"\",Vorgaben!$N27=\"\"),\"\",Vorgaben!$N27)","v":""}]
[{"$f":"IF(Vorgaben!$K28=\"\",\"\",Vorgaben!$K28)","v":""},{"$f":"IF(OR($A24=\"\",Vorgaben!$M$7=\"\"),\"\",Vorgaben!$M$7)","v":""},{"$f":"IF(OR($A24=\"\",Vorgaben!$N28=\"\"),\"\",Vorgaben!$N28)","v":""}]
[{"$f":"IF(Vorgaben!$K29=\"\",\"\",Vorgaben!$K29)","v":""},{"$f":"IF(OR($A25=\"\",Vorgaben!$M$7=\"\"),\"\",Vorgaben!$M$7)","v":""},{"$f":"IF(OR($A25=\"\",Vorgaben!$N29=\"\"),\"\",Vorgaben!$N29)","v":""}]
[{"$f":"IF(Vorgaben!$K30=\"\",\"\",Vorgaben!$K30)","v":""},{"$f":"IF(OR($A26=\"\",Vorgaben!$M$7=\"\"),\"\",Vorgaben!$M$7)","v":""},{"$f":"IF(OR($A26=\"\",Vorgaben!$N30=\"\"),\"\",Vorgaben!$N30)","v":""}]
[{"$f":"IF(Vorgaben!$K31=\"\",\"\",Vorgaben!$K31)","v":""},{"$f":"IF(OR($A27=\"\",Vorgaben!$M$7=\"\"),\"\",Vorgaben!$M$7)","v":""},{"$f":"IF(OR($A27=\"\",Vorgaben!$N31=\"\"),\"\",Vorgaben!$N31)","v":""}]
[{"$f":"IF(Vorgaben!$K32=\"\",\"\",Vorgaben!$K32)","v":""},{"$f":"IF(OR($A28=\"\",Vorgaben!$M$7=\"\"),\"\",Vorgaben!$M$7)","v":""},{"$f":"IF(OR($A28=\"\",Vorgaben!$N32=\"\"),\"\",Vorgaben!$N32)","v":""}]
[{"$f":"IF(Vorgaben!$K33=\"\",\"\",Vorgaben!$K33)","v":""},{"$f":"IF(OR($A29=\"\",Vorgaben!$M$7=\"\"),\"\",Vorgaben!$M$7)","v":""},{"$f":"IF(OR($A29=\"\",Vorgaben!$N33=\"\"),\"\",Vorgaben!$N33)","v":""}]
[{"$f":"IF(Vorgaben!$K34=\"\",\"\",Vorgaben!$K34)","v":""},{"$f":"IF(OR($A30=\"\",Vorgaben!$M$7=\"\"),\"\",Vorgaben!$M$7)","v":""},{"$f":"IF(OR($A30=\"\",Vorgaben!$N34=\"\"),\"\",Vorgaben!$N34)","v":""}]
[{"$f":"IF(Vorgaben!$K35=\"\",\"\",Vorgaben!$K35)","v":""},{"$f":"IF(OR($A31=\"\",Vorgaben!$M$7=\"\"),\"\",Vorgaben!$M$7)","v":""},{"$f":"IF(OR($A31=\"\",Vorgaben!$N35=\"\"),\"\",Vorgaben!$N35)","v":""}]
[{"$f":"IF(Vorgaben!$K36=\"\",\"\",Vorgaben!$K36)","v":""},{"$f":"IF(OR($A32=\"\",Vorgaben!$M$7=\"\"),\"\",Vorgaben!$M$7)","v":""},{"$f":"IF(OR($A32=\"\",Vorgaben!$N36=\"\"),\"\",Vorgaben!$N36)","v":""}]

{"sheet":"PDF Klasse 1","index":4,"n_rows":16,"n_cols":3,"rows_kept":16,"cut":false,"hidden":false,"merged":[[0,1,0,2]]}
[{"$f":"\"Klassenkurse der Klasse \"&Vorgaben!D6","v":"Klassenkurse der Klasse 05a"},"Sind Passwörter angegeben, so wurde der Kurs mit der Möglichkeit der Selbsteinschreibung importiert."]
["Klassenkursname ","Passwort Lehrer/in","Passwort Schüler/in"]
[{"$f":"IF(Klassenkurse!A2<>\"\",Klassenkurse!A2,\"\")","v":"2020-21 05a Klassenraum"},{"$f":"IF(Klassenkurse!G2<>\"\",Klassenkurse!G2,\"\")","v":"djv5456+"},{"$f":"IF(Klassenkurse!J2<>\"\",Klassenkurse!J2,\"\")","v":""}]
[{"$f":"IF(Klassenkurse!A3<>\"\",Klassenkurse!A3,\"\")","v":"2020-21 05a Deutsch"},{"$f":"IF(Klassenkurse!G3<>\"\",Klassenkurse!G3,\"\")","v":"djv5456+"},{"$f":"IF(Klassenkurse!J3<>\"\",Klassenkurse!J3,\"\")","v":""}]
[{"$f":"IF(Klassenkurse!A4<>\"\",Klassenkurse!A4,\"\")","v":"2020-21 05a Englisch"},{"$f":"IF(Klassenkurse!G4<>\"\",Klassenkurse!G4,\"\")","v":"djv5456+"},{"$f":"IF(Klassenkurse!J4<>\"\",Klassenkurse!J4,\"\")","v":""}]
[{"$f":"IF(Klassenkurse!A5<>\"\",Klassenkurse!A5,\"\")","v":"2020-21 05a Mathematik"},{"$f":"IF(Klassenkurse!G5<>\"\",Klassenkurse!G5,\"\")","v":"djv5456+"},{"$f":"IF(Klassenkurse!J5<>\"\",Klassenkurse!J5,\"\")","v":""}]
[{"$f":"IF(Klassenkurse!A6<>\"\",Klassenkurse!A6,\"\")","v":"2020-21 05a Biologie"},{"$f":"IF(Klassenkurse!G6<>\"\",Klassenkurse!G6,\"\")","v":"djv5456+"},{"$f":"IF(Klassenkurse!J6<>\"\",Klassenkurse!J6,\"\")","v":""}]
[{"$f":"IF(Klassenkurse!A7<>\"\",Klassenkurse!A7,\"\")","v":"2020-21 05a Physik"},{"$f":"IF(Klassenkurse!G7<>\"\",Klassenkurse!G7,\"\")","v":"djv5456+"},{"$f":"IF(Klassenkurse!J7<>\"\",Klassenkurse!J7,\"\")","v":""}]
[{"$f":"IF(Klassenkurse!A8<>\"\",Klassenkurse!A8,\"\")","v":"2020-21 05a Sport"},{"$f":"IF(Klassenkurse!G8<>\"\",Klassenkurse!G8,\"\")","v":"djv5456+"},{"$f":"IF(Klassenkurse!J8<>\"\",Klassenkurse!J8,\"\")","v":""}]
[{"$f":"IF(Klassenkurse!A9<>\"\",Klassenkurse!A9,\"\")","v":""},{"$f":"IF(Klassenkurse!G9<>\"\",Klassenkurse!G9,\"\")","v":""},{"$f":"IF(Klassenkurse!J9<>\"\",Klassenkurse!J9,\"\")","v":""}]
[{"$f":"IF(Klassenkurse!A10<>\"\",Klassenkurse!A10,\"\")","v":""},{"$f":"IF(Klassenkurse!G10<>\"\",Klassenkurse!G10,\"\")","v":""},{"$f":"IF(Klassenkurse!J10<>\"\",Klassenkurse!J10,\"\")","v":""}]
[{"$f":"IF(Klassenkurse!A11<>\"\",Klassenkurse!A11,\"\")","v":""},{"$f":"IF(Klassenkurse!G11<>\"\",Klassenkurse!G11,\"\")","v":""},{"$f":"IF(Klassenkurse!J11<>\"\",Klassenkurse!J11,\"\")","v":""}]
[{"$f":"IF(Klassenkurse!A12<>\"\",Klassenkurse!A12,\"\")","v":""},{"$f":"IF(Klassenkurse!G12<>\"\",Klassenkurse!G12,\"\")","v":""},{"$f":"IF(Klassenkurse!J12<>\"\",Klassenkurse!J12,\"\")","v":""}]
[{"$f":"IF(Klassenkurse!A13<>\"\",Klassenkurse!A13,\"\")","v":""},{"$f":"IF(Klassenkurse!G13<>\"\",Klassenkurse!G13,\"\")","v":""},{"$f":"IF(Klassenkurse!J13<>\"\",Klassenkurse!J13,\"\")","v":""}]
[{"$f":"IF(Klassenkurse!A14<>\"\",Klassenkurse!A14,\"\")","v":""},{"$f":"IF(Klassenkurse!G14<>\"\",Klassenkurse!G14,\"\")","v":""},{"$f":"IF(Klassenkurse!J14<>\"\",Klassenkurse!J14,\"\")","v":""}]
[{"$f":"IF(Klassenkurse!A15<>\"\",Klassenkurse!A15,\"\")","v":""},{"$f":"IF(Klassenkurse!G15<>\"\",Klassenkurse!G15,\"\")","v":""},{"$f":"IF(Klassenkurse!J15<>\"\",Klassenkurse!J15,\"\")","v":""}]

{"sheet":"PDF Klasse 2","index":5,"n_rows":17,"n_cols":3,"rows_kept":17,"cut":false,"hidden":false,"merged":[[0,1,0,2]]}
[{"$f":"\"Klassenkurse der Klasse \"&Vorgaben!D7","v":"Klassenkurse der Klasse 05b"},"Sind Passwörter angegeben, so wurde der Kurs mit der Möglichkeit der Selbsteinschreibung importiert."]
["Klassenkursname ","Passwort Lehrer/in","Passwort Schüler/in"]
[{"$f":"IF(Klassenkurse!A19<>\"\",Klassenkurse!A19,\"\")","v":"2020-21 05b Klassenraum"},{"$f":"IF(Klassenkurse!G19<>\"\",Klassenkurse!G19,\"\")","v":"djv5456+"},{"$f":"IF(Klassenkurse!J19<>\"\",Klassenkurse!J19,\"\")","v":""}]
[{"$f":"IF(Klassenkurse!A20<>\"\",Klassenkurse!A20,\"\")","v":"2020-21 05b Deutsch"},{"$f":"IF(Klassenkurse!G20<>\"\",Klassenkurse!G20,\"\")","v":"djv5456+"},{"$f":"IF(Klassenkurse!J20<>\"\",Klassenkurse!J20,\"\")","v":""}]
[{"$f":"IF(Klassenkurse!A21<>\"\",Klassenkurse!A21,\"\")","v":"2020-21 05b Englisch"},{"$f":"IF(Klassenkurse!G21<>\"\",Klassenkurse!G21,\"\")","v":"djv5456+"},{"$f":"IF(Klassenkurse!J21<>\"\",Klassenkurse!J21,\"\")","v":""}]
[{"$f":"IF(Klassenkurse!A22<>\"\",Klassenkurse!A22,\"\")","v":"2020-21 05b Mathematik"},{"$f":"IF(Klassenkurse!G22<>\"\",Klassenkurse!G22,\"\")","v":"djv5456+"},{"$f":"IF(Klassenkurse!J22<>\"\",Klassenkurse!J22,\"\")","v":""}]
[{"$f":"IF(Klassenkurse!A23<>\"\",Klassenkurse!A23,\"\")","v":"2020-21 05b Biologie"},{"$f":"IF(Klassenkurse!G23<>\"\",Klassenkurse!G23,\"\")","v":"djv5456+"},{"$f":"IF(Klassenkurse!J23<>\"\",Klassenkurse!J23,\"\")","v":""}]
[{"$f":"IF(Klassenkurse!A24<>\"\",Klassenkurse!A24,\"\")","v":"2020-21 05b Physik"},{"$f":"IF(Klassenkurse!G24<>\"\",Klassenkurse!G24,\"\")","v":"djv5456+"},{"$f":"IF(Klassenkurse!J24<>\"\",Klassenkurse!J24,\"\")","v":""}]
[{"$f":"IF(Klassenkurse!A25<>\"\",Klassenkurse!A25,\"\")","v":"2020-21 05b Sport"},{"$f":"IF(Klassenkurse!G25<>\"\",Klassenkurse!G25,\"\")","v":"djv5456+"},{"$f":"IF(Klassenkurse!J25<>\"\",Klassenkurse!J25,\"\")","v":""}]
[{"$f":"IF(Klassenkurse!A26<>\"\",Klassenkurse!A26,\"\")","v":""},{"$f":"IF(Klassenkurse!G26<>\"\",Klassenkurse!G26,\"\")","v":""},{"$f":"IF(Klassenkurse!J26<>\"\",Klassenkurse!J26,\"\")","v":""}]
[{"$f":"IF(Klassenkurse!A27<>\"\",Klassenkurse!A27,\"\")","v":""},{"$f":"IF(Klassenkurse!G27<>\"\",Klassenkurse!G27,\"\")","v":""},{"$f":"IF(Klassenkurse!J27<>\"\",Klassenkurse!J27,\"\")","v":""}]
[{"$f":"IF(Klassenkurse!A28<>\"\",Klassenkurse!A28,\"\")","v":""},{"$f":"IF(Klassenkurse!G28<>\"\",Klassenkurse!G28,\"\")","v":""},{"$f":"IF(Klassenkurse!J28<>\"\",Klassenkurse!J28,\"\")","v":""}]
[{"$f":"IF(Klassenkurse!A29<>\"\",Klassenkurse!A29,\"\")","v":""},{"$f":"IF(Klassenkurse!G29<>\"\",Klassenkurse!G29,\"\")","v":""},{"$f":"IF(Klassenkurse!J29<>\"\",Klassenkurse!J29,\"\")","v":""}]
[{"$f":"IF(Klassenkurse!A30<>\"\",Klassenkurse!A30,\"\")","v":""},{"$f":"IF(Klassenkurse!G30<>\"\",Klassenkurse!G30,\"\")","v":""},{"$f":"IF(Klassenkurse!J30<>\"\",Klassenkurse!J30,\"\")","v":""}]
[{"$f":"IF(Klassenkurse!A31<>\"\",Klassenkurse!A31,\"\")","v":""},{"$f":"IF(Klassenkurse!G31<>\"\",Klassenkurse!G31,\"\")","v":""},{"$f":"IF(Klassenkurse!J31<>\"\",Klassenkurse!J31,\"\")","v":""}]
[{"$f":"IF(Klassenkurse!A32<>\"\",Klassenkurse!A32,\"\")","v":""},{"$f":"IF(Klassenkurse!G32<>\"\",Klassenkurse!G32,\"\")","v":""},{"$f":"IF(Klassenkurse!J32<>\"\",Klassenkurse!J32,\"\")","v":""}]
[{"$f":"IF(Klassenkurse!A35<>\"\",Klassenkurse!A35,\"\")","v":""},{"$f":"IF(Klassenkurse!G35<>\"\",Klassenkurse!G35,\"\")","v":""},{"$f":"IF(Klassenkurse!J35<>\"\",Klassenkurse!J35,\"\")","v":""}]

{"sheet":"PDF Klasse 3","index":6,"n_rows":17,"n_cols":3,"rows_kept":17,"cut":false,"hidden":false,"merged":[[0,1,0,2]]}
[{"$f":"\"Klassenkurse der Klasse \"&Vorgaben!D8","v":"Klassenkurse der Klasse 05c"},"Sind Passwörter angegeben, so wurde der Kurs mit der Möglichkeit der Selbsteinschreibung importiert."]
["Klassenkursname ","Passwort Lehrer/in","Passwort Schüler/in"]
[{"$f":"IF(Klassenkurse!A36<>\"\",Klassenkurse!A36,\"\")","v":"2020-21 05c Klassenraum"},{"$f":"IF(Klassenkurse!G36<>\"\",Klassenkurse!G36,\"\")","v":"djv5456+"},{"$f":"IF(Klassenkurse!J36<>\"\",Klassenkurse!J36,\"\")","v":""}]
[{"$f":"IF(Klassenkurse!A37<>\"\",Klassenkurse!A37,\"\")","v":"2020-21 05c Deutsch"},{"$f":"IF(Klassenkurse!G37<>\"\",Klassenkurse!G37,\"\")","v":"djv5456+"},{"$f":"IF(Klassenkurse!J37<>\"\",Klassenkurse!J37,\"\")","v":""}]
[{"$f":"IF(Klassenkurse!A38<>\"\",Klassenkurse!A38,\"\")","v":"2020-21 05c Englisch"},{"$f":"IF(Klassenkurse!G38<>\"\",Klassenkurse!G38,\"\")","v":"djv5456+"},{"$f":"IF(Klassenkurse!J38<>\"\",Klassenkurse!J38,\"\")","v":""}]
[{"$f":"IF(Klassenkurse!A39<>\"\",Klassenkurse!A39,\"\")","v":"2020-21 05c Mathematik"},{"$f":"IF(Klassenkurse!G39<>\"\",Klassenkurse!G39,\"\")","v":"djv5456+"},{"$f":"IF(Klassenkurse!J39<>\"\",Klassenkurse!J39,\"\")","v":""}]
[{"$f":"IF(Klassenkurse!A40<>\"\",Klassenkurse!A40,\"\")","v":"2020-21 05c Biologie"},{"$f":"IF(Klassenkurse!G40<>\"\",Klassenkurse!G40,\"\")","v":"djv5456+"},{"$f":"IF(Klassenkurse!J40<>\"\",Klassenkurse!J40,\"\")","v":""}]
[{"$f":"IF(Klassenkurse!A41<>\"\",Klassenkurse!A41,\"\")","v":"2020-21 05c Physik"},{"$f":"IF(Klassenkurse!G41<>\"\",Klassenkurse!G41,\"\")","v":"djv5456+"},{"$f":"IF(Klassenkurse!J41<>\"\",Klassenkurse!J41,\"\")","v":""}]
[{"$f":"IF(Klassenkurse!A42<>\"\",Klassenkurse!A42,\"\")","v":"2020-21 05c Sport"},{"$f":"IF(Klassenkurse!G42<>\"\",Klassenkurse!G42,\"\")","v":"djv5456+"},{"$f":"IF(Klassenkurse!J42<>\"\",Klassenkurse!J42,\"\")","v":""}]
[{"$f":"IF(Klassenkurse!A43<>\"\",Klassenkurse!A43,\"\")","v":""},{"$f":"IF(Klassenkurse!G43<>\"\",Klassenkurse!G43,\"\")","v":""},{"$f":"IF(Klassenkurse!J43<>\"\",Klassenkurse!J43,\"\")","v":""}]
[{"$f":"IF(Klassenkurse!A44<>\"\",Klassenkurse!A44,\"\")","v":""},{"$f":"IF(Klassenkurse!G44<>\"\",Klassenkurse!G44,\"\")","v":""},{"$f":"IF(Klassenkurse!J44<>\"\",Klassenkurse!J44,\"\")","v":""}]
[{"$f":"IF(Klassenkurse!A45<>\"\",Klassenkurse!A45,\"\")","v":""},{"$f":"IF(Klassenkurse!G45<>\"\",Klassenkurse!G45,\"\")","v":""},{"$f":"IF(Klassenkurse!J45<>\"\",Klassenkurse!J45,\"\")","v":""}]
[{"$f":"IF(Klassenkurse!A46<>\"\",Klassenkurse!A46,\"\")","v":""},{"$f":"IF(Klassenkurse!G46<>\"\",Klassenkurse!G46,\"\")","v":""},{"$f":"IF(Klassenkurse!J46<>\"\",Klassenkurse!J46,\"\")","v":""}]
[{"$f":"IF(Klassenkurse!A47<>\"\",Klassenkurse!A47,\"\")","v":""},{"$f":"IF(Klassenkurse!G47<>\"\",Klassenkurse!G47,\"\")","v":""},{"$f":"IF(Klassenkurse!J47<>\"\",Klassenkurse!J47,\"\")","v":""}]
[{"$f":"IF(Klassenkurse!A48<>\"\",Klassenkurse!A48,\"\")","v":""},{"$f":"IF(Klassenkurse!G48<>\"\",Klassenkurse!G48,\"\")","v":""},{"$f":"IF(Klassenkurse!J48<>\"\",Klassenkurse!J48,\"\")","v":""}]
[{"$f":"IF(Klassenkurse!A49<>\"\",Klassenkurse!A49,\"\")","v":""},{"$f":"IF(Klassenkurse!G49<>\"\",Klassenkurse!G49,\"\")","v":""},{"$f":"IF(Klassenkurse!J49<>\"\",Klassenkurse!J49,\"\")","v":""}]
[{"$f":"IF(Klassenkurse!A52<>\"\",Klassenkurse!A52,\"\")","v":""},{"$f":"IF(Klassenkurse!G52<>\"\",Klassenkurse!G52,\"\")","v":""},{"$f":"IF(Klassenkurse!J52<>\"\",Klassenkurse!J52,\"\")","v":""}]

{"sheet":"PDF Klasse 4","index":7,"n_rows":17,"n_cols":3,"rows_kept":17,"cut":false,"hidden":false,"merged":[[0,1,0,2]]}
[{"$f":"\"Klassenkurse der Klasse \"&Vorgaben!D9","v":"Klassenkurse der Klasse "},"Sind Passwörter angegeben, so wurde der Kurs mit der Möglichkeit der Selbsteinschreibung importiert."]
["Klassenkursname ","Passwort Lehrer/in","Passwort Schüler/in"]
[{"$f":"IF(Klassenkurse!A53<>\"\",Klassenkurse!A53,\"\")","v":""},{"$f":"IF(Klassenkurse!G53<>\"\",Klassenkurse!G53,\"\")","v":""},{"$f":"IF(Klassenkurse!J53<>\"\",Klassenkurse!J53,\"\")","v":""}]
[{"$f":"IF(Klassenkurse!A54<>\"\",Klassenkurse!A54,\"\")","v":""},{"$f":"IF(Klassenkurse!G54<>\"\",Klassenkurse!G54,\"\")","v":""},{"$f":"IF(Klassenkurse!J54<>\"\",Klassenkurse!J54,\"\")","v":""}]
[{"$f":"IF(Klassenkurse!A55<>\"\",Klassenkurse!A55,\"\")","v":""},{"$f":"IF(Klassenkurse!G55<>\"\",Klassenkurse!G55,\"\")","v":""},{"$f":"IF(Klassenkurse!J55<>\"\",Klassenkurse!J55,\"\")","v":""}]
[{"$f":"IF(Klassenkurse!A56<>\"\",Klassenkurse!A56,\"\")","v":""},{"$f":"IF(Klassenkurse!G56<>\"\",Klassenkurse!G56,\"\")","v":""},{"$f":"IF(Klassenkurse!J56<>\"\",Klassenkurse!J56,\"\")","v":""}]
[{"$f":"IF(Klassenkurse!A57<>\"\",Klassenkurse!A57,\"\")","v":""},{"$f":"IF(Klassenkurse!G57<>\"\",Klassenkurse!G57,\"\")","v":""},{"$f":"IF(Klassenkurse!J57<>\"\",Klassenkurse!J57,\"\")","v":""}]
[{"$f":"IF(Klassenkurse!A58<>\"\",Klassenkurse!A58,\"\")","v":""},{"$f":"IF(Klassenkurse!G58<>\"\",Klassenkurse!G58,\"\")","v":""},{"$f":"IF(Klassenkurse!J58<>\"\",Klassenkurse!J58,\"\")","v":""}]
[{"$f":"IF(Klassenkurse!A59<>\"\",Klassenkurse!A59,\"\")","v":""},{"$f":"IF(Klassenkurse!G59<>\"\",Klassenkurse!G59,\"\")","v":""},{"$f":"IF(Klassenkurse!J59<>\"\",Klassenkurse!J59,\"\")","v":""}]
[{"$f":"IF(Klassenkurse!A60<>\"\",Klassenkurse!A60,\"\")","v":""},{"$f":"IF(Klassenkurse!G60<>\"\",Klassenkurse!G60,\"\")","v":""},{"$f":"IF(Klassenkurse!J60<>\"\",Klassenkurse!J60,\"\")","v":""}]
[{"$f":"IF(Klassenkurse!A61<>\"\",Klassenkurse!A61,\"\")","v":""},{"$f":"IF(Klassenkurse!G61<>\"\",Klassenkurse!G61,\"\")","v":""},{"$f":"IF(Klassenkurse!J61<>\"\",Klassenkurse!J61,\"\")","v":""}]
[{"$f":"IF(Klassenkurse!A62<>\"\",Klassenkurse!A62,\"\")","v":""},{"$f":"IF(Klassenkurse!G62<>\"\",Klassenkurse!G62,\"\")","v":""},{"$f":"IF(Klassenkurse!J62<>\"\",Klassenkurse!J62,\"\")","v":""}]
[{"$f":"IF(Klassenkurse!A63<>\"\",Klassenkurse!A63,\"\")","v":""},{"$f":"IF(Klassenkurse!G63<>\"\",Klassenkurse!G63,\"\")","v":""},{"$f":"IF(Klassenkurse!J63<>\"\",Klassenkurse!J63,\"\")","v":""}]
[{"$f":"IF(Klassenkurse!A64<>\"\",Klassenkurse!A64,\"\")","v":""},{"$f":"IF(Klassenkurse!G64<>\"\",Klassenkurse!G64,\"\")","v":""},{"$f":"IF(Klassenkurse!J64<>\"\",Klassenkurse!J64,\"\")","v":""}]
[{"$f":"IF(Klassenkurse!A65<>\"\",Klassenkurse!A65,\"\")","v":""},{"$f":"IF(Klassenkurse!G65<>\"\",Klassenkurse!G65,\"\")","v":""},{"$f":"IF(Klassenkurse!J65<>\"\",Klassenkurse!J65,\"\")","v":""}]
[{"$f":"IF(Klassenkurse!A66<>\"\",Klassenkurse!A66,\"\")","v":""},{"$f":"IF(Klassenkurse!G66<>\"\",Klassenkurse!G66,\"\")","v":""},{"$f":"IF(Klassenkurse!J66<>\"\",Klassenkurse!J66,\"\")","v":""}]
[{"$f":"IF(Klassenkurse!A69<>\"\",Klassenkurse!A69,\"\")","v":""},{"$f":"IF(Klassenkurse!G69<>\"\",Klassenkurse!G69,\"\")","v":""},{"$f":"IF(Klassenkurse!J69<>\"\",Klassenkurse!J69,\"\")","v":""}]

{"sheet":"PDF Klasse 5","index":8,"n_rows":17,"n_cols":3,"rows_kept":17,"cut":false,"hidden":false,"merged":[[0,1,0,2]]}
[{"$f":"\"Klassenkurse der Klasse \"&Vorgaben!D10","v":"Klassenkurse der Klasse "},"Sind Passwörter angegeben, so wurde der Kurs mit der Möglichkeit der Selbsteinschreibung importiert."]
["Klassenkursname ","Passwort Lehrer/in","Passwort Schüler/in"]
[{"$f":"IF(Klassenkurse!A70<>\"\",Klassenkurse!A70,\"\")","v":""},{"$f":"IF(Klassenkurse!G70<>\"\",Klassenkurse!G70,\"\")","v":""},{"$f":"IF(Klassenkurse!J70<>\"\",Klassenkurse!J70,\"\")","v":""}]
[{"$f":"IF(Klassenkurse!A71<>\"\",Klassenkurse!A71,\"\")","v":""},{"$f":"IF(Klassenkurse!G71<>\"\",Klassenkurse!G71,\"\")","v":""},{"$f":"IF(Klassenkurse!J71<>\"\",Klassenkurse!J71,\"\")","v":""}]
[{"$f":"IF(Klassenkurse!A72<>\"\",Klassenkurse!A72,\"\")","v":""},{"$f":"IF(Klassenkurse!G72<>\"\",Klassenkurse!G72,\"\")","v":""},{"$f":"IF(Klassenkurse!J72<>\"\",Klassenkurse!J72,\"\")","v":""}]
[{"$f":"IF(Klassenkurse!A73<>\"\",Klassenkurse!A73,\"\")","v":""},{"$f":"IF(Klassenkurse!G73<>\"\",Klassenkurse!G73,\"\")","v":""},{"$f":"IF(Klassenkurse!J73<>\"\",Klassenkurse!J73,\"\")","v":""}]
[{"$f":"IF(Klassenkurse!A74<>\"\",Klassenkurse!A74,\"\")","v":""},{"$f":"IF(Klassenkurse!G74<>\"\",Klassenkurse!G74,\"\")","v":""},{"$f":"IF(Klassenkurse!J74<>\"\",Klassenkurse!J74,\"\")","v":""}]
[{"$f":"IF(Klassenkurse!A75<>\"\",Klassenkurse!A75,\"\")","v":""},{"$f":"IF(Klassenkurse!G75<>\"\",Klassenkurse!G75,\"\")","v":""},{"$f":"IF(Klassenkurse!J75<>\"\",Klassenkurse!J75,\"\")","v":""}]
[{"$f":"IF(Klassenkurse!A76<>\"\",Klassenkurse!A76,\"\")","v":""},{"$f":"IF(Klassenkurse!G76<>\"\",Klassenkurse!G76,\"\")","v":""},{"$f":"IF(Klassenkurse!J76<>\"\",Klassenkurse!J76,\"\")","v":""}]
[{"$f":"IF(Klassenkurse!A77<>\"\",Klassenkurse!A77,\"\")","v":""},{"$f":"IF(Klassenkurse!G77<>\"\",Klassenkurse!G77,\"\")","v":""},{"$f":"IF(Klassenkurse!J77<>\"\",Klassenkurse!J77,\"\")","v":""}]
[{"$f":"IF(Klassenkurse!A78<>\"\",Klassenkurse!A78,\"\")","v":""},{"$f":"IF(Klassenkurse!G78<>\"\",Klassenkurse!G78,\"\")","v":""},{"$f":"IF(Klassenkurse!J78<>\"\",Klassenkurse!J78,\"\")","v":""}]
[{"$f":"IF(Klassenkurse!A79<>\"\",Klassenkurse!A79,\"\")","v":""},{"$f":"IF(Klassenkurse!G79<>\"\",Klassenkurse!G79,\"\")","v":""},{"$f":"IF(Klassenkurse!J79<>\"\",Klassenkurse!J79,\"\")","v":""}]
[{"$f":"IF(Klassenkurse!A80<>\"\",Klassenkurse!A80,\"\")","v":""},{"$f":"IF(Klassenkurse!G80<>\"\",Klassenkurse!G80,\"\")","v":""},{"$f":"IF(Klassenkurse!J80<>\"\",Klassenkurse!J80,\"\")","v":""}]
[{"$f":"IF(Klassenkurse!A81<>\"\",Klassenkurse!A81,\"\")","v":""},{"$f":"IF(Klassenkurse!G81<>\"\",Klassenkurse!G81,\"\")","v":""},{"$f":"IF(Klassenkurse!J81<>\"\",Klassenkurse!J81,\"\")","v":""}]
[{"$f":"IF(Klassenkurse!A82<>\"\",Klassenkurse!A82,\"\")","v":""},{"$f":"IF(Klassenkurse!G82<>\"\",Klassenkurse!G82,\"\")","v":""},{"$f":"IF(Klassenkurse!J82<>\"\",Klassenkurse!J82,\"\")","v":""}]
[{"$f":"IF(Klassenkurse!A83<>\"\",Klassenkurse!A83,\"\")","v":""},{"$f":"IF(Klassenkurse!G83<>\"\",Klassenkurse!G83,\"\")","v":""},{"$f":"IF(Klassenkurse!J83<>\"\",Klassenkurse!J83,\"\")","v":""}]
[{"$f":"IF(Klassenkurse!A86<>\"\",Klassenkurse!A86,\"\")","v":""},{"$f":"IF(Klassenkurse!G86<>\"\",Klassenkurse!G86,\"\")","v":""},{"$f":"IF(Klassenkurse!J86<>\"\",Klassenkurse!J86,\"\")","v":""}]

{"sheet":"PDF Klasse 6","index":9,"n_rows":17,"n_cols":3,"rows_kept":17,"cut":false,"hidden":false,"merged":[[0,1,0,2]]}
[{"$f":"\"Klassenkurse der Klasse \"&Vorgaben!D11","v":"Klassenkurse der Klasse "},"Sind Passwörter angegeben, so wurde der Kurs mit der Möglichkeit der Selbsteinschreibung importiert."]
["Klassenkursname ","Passwort Lehrer/in","Passwort Schüler/in"]
[{"$f":"IF(Klassenkurse!A87<>\"\",Klassenkurse!A87,\"\")","v":""},{"$f":"IF(Klassenkurse!G87<>\"\",Klassenkurse!G87,\"\")","v":""},{"$f":"IF(Klassenkurse!J87<>\"\",Klassenkurse!J87,\"\")","v":""}]
[{"$f":"IF(Klassenkurse!A88<>\"\",Klassenkurse!A88,\"\")","v":""},{"$f":"IF(Klassenkurse!G88<>\"\",Klassenkurse!G88,\"\")","v":""},{"$f":"IF(Klassenkurse!J88<>\"\",Klassenkurse!J88,\"\")","v":""}]
[{"$f":"IF(Klassenkurse!A89<>\"\",Klassenkurse!A89,\"\")","v":""},{"$f":"IF(Klassenkurse!G89<>\"\",Klassenkurse!G89,\"\")","v":""},{"$f":"IF(Klassenkurse!J89<>\"\",Klassenkurse!J89,\"\")","v":""}]
[{"$f":"IF(Klassenkurse!A90<>\"\",Klassenkurse!A90,\"\")","v":""},{"$f":"IF(Klassenkurse!G90<>\"\",Klassenkurse!G90,\"\")","v":""},{"$f":"IF(Klassenkurse!J90<>\"\",Klassenkurse!J90,\"\")","v":""}]
[{"$f":"IF(Klassenkurse!A91<>\"\",Klassenkurse!A91,\"\")","v":""},{"$f":"IF(Klassenkurse!G91<>\"\",Klassenkurse!G91,\"\")","v":""},{"$f":"IF(Klassenkurse!J91<>\"\",Klassenkurse!J91,\"\")","v":""}]
[{"$f":"IF(Klassenkurse!A92<>\"\",Klassenkurse!A92,\"\")","v":""},{"$f":"IF(Klassenkurse!G92<>\"\",Klassenkurse!G92,\"\")","v":""},{"$f":"IF(Klassenkurse!J92<>\"\",Klassenkurse!J92,\"\")","v":""}]
[{"$f":"IF(Klassenkurse!A93<>\"\",Klassenkurse!A93,\"\")","v":""},{"$f":"IF(Klassenkurse!G93<>\"\",Klassenkurse!G93,\"\")","v":""},{"$f":"IF(Klassenkurse!J93<>\"\",Klassenkurse!J93,\"\")","v":""}]
[{"$f":"IF(Klassenkurse!A94<>\"\",Klassenkurse!A94,\"\")","v":""},{"$f":"IF(Klassenkurse!G94<>\"\",Klassenkurse!G94,\"\")","v":""},{"$f":"IF(Klassenkurse!J94<>\"\",Klassenkurse!J94,\"\")","v":""}]
[{"$f":"IF(Klassenkurse!A95<>\"\",Klassenkurse!A95,\"\")","v":""},{"$f":"IF(Klassenkurse!G95<>\"\",Klassenkurse!G95,\"\")","v":""},{"$f":"IF(Klassenkurse!J95<>\"\",Klassenkurse!J95,\"\")","v":""}]
[{"$f":"IF(Klassenkurse!A96<>\"\",Klassenkurse!A96,\"\")","v":""},{"$f":"IF(Klassenkurse!G96<>\"\",Klassenkurse!G96,\"\")","v":""},{"$f":"IF(Klassenkurse!J96<>\"\",Klassenkurse!J96,\"\")","v":""}]
[{"$f":"IF(Klassenkurse!A97<>\"\",Klassenkurse!A97,\"\")","v":""},{"$f":"IF(Klassenkurse!G97<>\"\",Klassenkurse!G97,\"\")","v":""},{"$f":"IF(Klassenkurse!J97<>\"\",Klassenkurse!J97,\"\")","v":""}]
[{"$f":"IF(Klassenkurse!A98<>\"\",Klassenkurse!A98,\"\")","v":""},{"$f":"IF(Klassenkurse!G98<>\"\",Klassenkurse!G98,\"\")","v":""},{"$f":"IF(Klassenkurse!J98<>\"\",Klassenkurse!J98,\"\")","v":""}]
[{"$f":"IF(Klassenkurse!A99<>\"\",Klassenkurse!A99,\"\")","v":""},{"$f":"IF(Klassenkurse!G99<>\"\",Klassenkurse!G99,\"\")","v":""},{"$f":"IF(Klassenkurse!J99<>\"\",Klassenkurse!J99,\"\")","v":""}]
[{"$f":"IF(Klassenkurse!A100<>\"\",Klassenkurse!A100,\"\")","v":""},{"$f":"IF(Klassenkurse!G100<>\"\",Klassenkurse!G100,\"\")","v":""},{"$f":"IF(Klassenkurse!J100<>\"\",Klassenkurse!J100,\"\")","v":""}]
[{"$f":"IF(Klassenkurse!A103<>\"\",Klassenkurse!A103,\"\")","v":""},{"$f":"IF(Klassenkurse!G103<>\"\",Klassenkurse!G103,\"\")","v":""},{"$f":"IF(Klassenkurse!J103<>\"\",Klassenkurse!J103,\"\")","v":""}]