{"text_format":"1","workbook":"xlsx","n_sheets":3,"sheets":["Vorgaben","Moodlekurs","PDF-Vorlage"],"not_rendered":{"charts":0,"images":1,"macros":1,"external_links":0,"defined_names":2,"comments":0,"pivot_tables":0},"unopened":[],"bounds":{"document_bytes":16777216,"sheet_cells":100000,"rows_first":2000,"rows_last":500,"rows_between":2000,"halvings":0,"cell_chars":16384,"cell_head_chars":4096},"cells_cut":0,"cells_raw":0,"read":"whole","date_system":"1900"}

{"sheet":"Vorgaben","index":0,"n_rows":6,"n_cols":2,"rows_kept":6,"cut":false,"hidden":false,"merged":[]}
[]
[null,"Vorgaben"]
[null,"Für diese Tabelle ist nur eine Vorgabe nötig, die Schulnummer."]
[null,"Tragen Sie diese hier in das gelbe Feld ein."]
[]
[null,166455]

{"sheet":"Moodlekurs","index":1,"n_rows":100,"n_cols":7,"rows_kept":100,"cut":false,"hidden":false,"merged":[]}
["username","firstname","lastname","profile_field_Lehrer_in","cohort1","password","email"]
[{"$f":"IF(AND(C2=\"\",B2=\"\"),\"\",SUBSTITUTE(SUBSTITUTE(SUBSTITUTE(SUBSTITUTE(SUBSTITUTE(SUBSTITUTE(LOWER(B2),\"ß\",\"ss\"),\"ä\",\"ae\"),\"ö\",\"oe\"),\"ü\",\"ue\"),\" \",\"-\"),\"é\",\"e\")&\".\"&SUBSTITUTE(SUBSTITUTE(SUBSTITUTE(SUBSTITUTE(SUBSTITUTE(SUBSTITUTE(LOWER(C2),\"ß\",\"ss\"),\"ä\",\"ae\"),\"ö\",\"oe\"),\"ü\",\"ue\"),\" \",\"-\"),\"é\",\"e\"))","v":"lehrer.lempel"},"Lehrer","Lempel",{"$f":"IF(OR(B2=\"\",A2=\"\",$E$2=\"\"),\"\",\"1\")","v":"1"},"Lehrer","Neuhinzu2020#",{"$f":"IF(OR(C2=\"\",B2=\"\"),\"\",A2&\"@\"&Vorgaben!$B$6&\".logineonrw-lms.de\")","v":"lehrer.lempel@166455.logineonrw-lms.de"}]
[{"$f":"IF(AND(C3=\"\",B3=\"\"),\"\",SUBSTITUTE(SUBSTITUTE(SUBSTITUTE(SUBSTITUTE(SUBSTITUTE(SUBSTITUTE(LOWER(B3),\"ß\",\"ss\"),\"ä\",\"ae\"),\"ö\",\"oe\"),\"ü\",\"ue\"),\" \",\"-\"),\"é\",\"e\")&\".\"&SUBSTITUTE(SUBSTITUTE(SUBSTITUTE(SUBSTITUTE(SUBSTITUTE(SUBSTITUTE(LOWER(C3),\"ß\",\"ss\"),\"ä\",\"ae\"),\"ö\",\"oe\"),\"ü\",\"ue\"),\" \",\"-\"),\"é\",\"e\"))","v":""},null,null,{"$f":"IF(OR(B3=\"\",A3=\"\",$E$2=\"\"),\"\",\"1\")","v":""},{"$f":"IF(OR(B3=\"\",A3=\"\",$E$2=\"\"),\"\",E2)","v":""},{"$f":"IF(OR(C3=\"\",B3=\"\",$F$2=\"\"),\"\",$F$2)","v":""},{"$f":"IF(OR(C3=\"\",B3=\"\"),\"\",A3&\"@\"&Vorgaben!$B$6&\".logineonrw-lms.de\")","v":""}]
["",null,null,{"$f":"IF(OR(B4=\"\",A4=\"\",$E$2=\"\"),\"\",\"1\")","v":""},{"$f":"IF(OR(B4=\"\",A4=\"\",$E$2=\"\"),\"\",E3)","v":""},{"$f":"IF(OR(C4=\"\",B4=\"\",$F$2=\"\"),\"\",$F$2)","v":""},{"$f":"IF(OR(C4=\"\",B4=\"\"),\"\",A4&\"@\"&Vorgaben!$B$6&\".logineonrw-lms.de\")","v":""}]
["",null,null,"","","",{"$f":"IF(OR(C5=\"\",B5=\"\"),\"\",A5&\"@\"&Vorgaben!$B$6&\".logineonrw-lms.de\")","v":""}]
["",null,null,"","","",{"$f":"IF(OR(C6=\"\",B6=\"\"),\"\",A6&\"@\"&Vorgaben!$B$6&\".logineonrw-lms.de\")","v":""}]
["",null,null,"","","",{"$f":"IF(OR(C7=\"\",B7=\"\"),\"\",A7&\"@\"&Vorgaben!$B$6&\".logineonrw-lms.de\")","v":""}]
["",null,null,"","","",{"$f":"IF(OR(C8=\"\",B8=\"\"),\"\",A8&\"@\"&Vorgaben!$B$6&\".logineonrw-lms.de\")","v":""}]
["",null,null,"","","",{"$f":"IF(OR(C9=\"\",B9=\"\"),\"\",A9&\"@\"&Vorgaben!$B$6&\".logineonrw-lms.de\")","v":""}]
["",null,null,"","","",{"$f":"IF(OR(C10=\"\",B10=\"\"),\"\",A10&\"@\"&Vorgaben!$B$6&\".logineonrw-lms.de\")","v":""}]
["",null,null,"","","",{"$f":"IF(OR(C11=\"\",B11=\"\"),\"\",A11&\"@\"&Vorgaben!$B$6&\".logineonrw-lms.de\")","v":""}]
["",null,null,"","","",{"$f":"IF(OR(C12=\"\",B12=\"\"),\"\",A12&\"@\"&Vorgaben!$B$6&\".logineonrw-lms.de\")","v":""}]
["",null,null,"","","",{"$f":"IF(OR(C13=\"\",B13=\"\"),\"\",A13&\"@\"&Vorgaben!$B$6&\".logineonrw-lms.de\")","v":""}]
["",null,null,"","","",{"$f":"IF(OR(C14=\"\",B14=\"\"),\"\",A14&\"@\"&Vorgaben!$B$6&\".logineonrw-lms.de\")","v":""}]
["",null,null,"","","",{"$f":"IF(OR(C15=\"\",B15=\"\"),\"\",A15&\"@\"&Vorgaben!$B$6&\".logineonrw-lms.de\")","v":""}]
["",null,null,"","","",{"$f":"IF(OR(C16=\"\",B16=\"\"),\"\",A16&\"@\"&Vorgaben!$B$6&\".logineonrw-lms.de\")","v":""}]
["",null,null,"","","",{"$f":"IF(OR(C17=\"\",B17=\"\"),\"\",A17&\"@\"&Vorgaben!$B$6&\".logineonrw-lms.de\")","v":""}]
["",null,null,"","","",{"$f":"IF(OR(C18=\"\",B18=\"\"),\"\",A18&\"@\"&Vorgaben!$B$6&\".logineonrw-lms.de\")","v":""}]
["",null,null,"","","",{"$f":"IF(OR(C19=\"\",B19=\"\"),\"\",A19&\"@\"&Vorgaben!$B$6&\".logineonrw-lms.de\")","v":""}]
["",null,null,"","","",{"$f":"IF(OR(C20=\"\",B20=\"\"),\"\",A20&\"@\"&Vorgaben!$B$6&\".logineonrw-lms.de\")","v":""}]
["",null,null,"","","",{"$f":"IF(OR(C21=\"\",B21=\"\"),\"\",A21&\"@\"&Vorgaben!$B$6&\".logineonrw-lms.de\")","v":""}]
["",null,null,"","","",{"$f":"IF(OR(C22=\"\",B22=\"\"),\"\",A22&\"@\"&Vorgaben!$B$6&\".logineonrw-lms.de\")","v":""}]
["",null,null,"","","",{"$f":"IF(OR(C23=\"\",B23=\"\"),\"\",A23&\"@\"&Vorgaben!$B$6&\".logineonrw-lms.de\")","v":""}]
["",null,null,"","","",{"$f":"IF(OR(C24=\"\",B24=\"\"),\"\",A24&\"@\"&Vorgaben!$B$6&\".logineonrw-lms.de\")","v":""}]
["",null,null,"","","",{"$f":"IF(OR(C25=\"\",B25=\"\"),\"\",A25&\"@\"&Vorgaben!$B$6&\".logineonrw-lms.de\")","v":""}]
["",null,null,"","","",{"$f":"IF(OR(C26=\"\",B26=\"\"),\"\",A26&\"@\"&Vorgaben!$B$6&\".logineonrw-lms.de\")","v":""}]
["",null,null,"","","",{"$f":"IF(OR(C27=\"\",B27=\"\"),\"\",A27&\"@\"&Vorgaben!$B$6&\".logineonrw-lms.de\")","v":""}]
["",null,null,"","","",{"$f":"IF(OR(C28=\"\",B28=\"\"),\"\",A28&\"@\"&Vorgaben!$B$6&\".logineonrw-lms.de\")","v":""}]
["",null,null,"","","",{"$f":"IF(OR(C29=\"\",B29=\"\"),\"\",A29&\"@\"&Vorgaben!$B$6&\".logineonrw-lms.de\")","v":""}]
["",null,null,"","","",{"$f":"IF(OR(C30=\"\",B30=\"\"),\"\",A30&\"@\"&Vorgaben!$B$6&\".logineonrw-lms.de\")","v":""}]
["",null,null,"","","",{"$f":"IF(OR(C31=\"\",B31=\"\"),\"\",A31&\"@\"&Vorgaben!$B$6&\".logineonrw-lms.de\")","v":""}]
["",null,null,"","","",{"$f":"IF(OR(C32=\"\",B32=\"\"),\"\",A32&\"@\"&Vorgaben!$B$6&\".logineonrw-lms.de\")","v":""}]
["",null,null,"","","",{"$f":"IF(OR(C33=\"\",B33=\"\"),\"\",A33&\"@\"&Vorgaben!$B$6&\".logineonrw-lms.de\")","v":""}]
["",null,null,"","","",{"$f":"IF(OR(C34=\"\",B34=\"\"),\"\",A34&\"@\"&Vorgaben!$B$6&\".logineonrw-lms.de\")","v":""}]
["",null,null,"","","",{"$f":"IF(OR(C35=\"\",B35=\"\"),\"\",A35&\"@\"&Vorgaben!$B$6&\".logineonrw-lms.de\")","v":""}]
["",null,null,"","","",{"$f":"IF(OR(C36=\"\",B36=\"\"),\"\",A36&\"@\"&Vorgaben!$B$6&\".logineonrw-lms.de\")","v":""}]
["",null,null,"","","",{"$f":"IF(OR(C37=\"\",B37=\"\"),\"\",A37&\"@\"&Vorgaben!$B$6&\".logineonrw-lms.de\")","v":""}]
["",null,null,"","","",{"$f":"IF(OR(C38=\"\",B38=\"\"),\"\",A38&\"@\"&Vorgaben!$B$6&\".logineonrw-lms.de\")","v":""}]
["",null,null,"","","",{"$f":"IF(OR(C39=\"\",B39=\"\"),\"\",A39&\"@\"&Vorgaben!$B$6&\".logineonrw-lms.de\")","v":""}]
["",null,null,"","","",{"$f":"IF(OR(C40=\"\",B40=\"\"),\"\",A40&\"@\"&Vorgaben!$B$6&\".logineonrw-lms.de\")","v":""}]
["",null,null,"","","",{"$f":"IF(OR(C41=\"\",B41=\"\"),\"\",A41&\"@\"&Vorgaben!$B$6&\".logineonrw-lms.de\")","v":""}]
["",null,null,"","","",{"$f":"IF(OR(C42=\"\",B42=\"\"),\"\",A42&\"@\"&Vorgaben!$B$6&\".logineonrw-lms.de\")","v":""}]
["",null,null,"","","",{"$f":"IF(OR(C43=\"\",B43=\"\"),\"\",A43&\"@\"&Vorgaben!$B$6&\".logineonrw-lms.de\")","v":""}]
["",null,null,"","","",{"$f":"IF(OR(C44=\"\",B44=\"\"),\"\",A44&\"@\"&Vorgaben!$B$6&\".logineonrw-lms.de\")","v":""}]
["",null,null,"","","",{"$f":"IF(OR(C45=\"\",B45=\"\"),\"\",A45&\"@\"&Vorgaben!$B$6&\".logineonrw-lms.de\")","v":""}]
["",null,null,"","","",{"$f":"IF(OR(C46=\"\",B46=\"\"),\"\",A46&\"@\"&Vorgaben!$B$6&\".logineonrw-lms.de\")","v":""}]
["",null,null,"","","",{"$f":"IF(OR(C47=\"\",B47=\"\"),\"\",A47&\"@\"&Vorgaben!$B$6&\".logineonrw-lms.de\")","v":""}]
["",null,null,"","","",{"$f":"IF(OR(C48=\"\",B48=\"\"),\"\",A48&\"@\"&Vorgaben!$B$6&\".logineonrw-lms.de\")","v":""}]
["",null,null,"","","",{"$f":"IF(OR(C49=\"\",B49=\"\"),\"\",A49&\"@\"&Vorgaben!$B$6&\".logineonrw-lms.de\")","v":""}]
["",null,null,"","","",{"$f":"IF(OR(C50=\"\",B50=\"\"),\"\",A50&\"@\"&Vorgaben!$B$6&\".logineonrw-lms.de\")","v":""}]
["",null,null,"","","",{"$f":"IF(OR(C51=\"\",B51=\"\"),\"\",A51&\"@\"&Vorgaben!$B$6&\".logineonrw-lms.de\")","v":""}]
["",null,null,"","","",{"$f":"IF(OR(C52=\"\",B52=\"\"),\"\",A52&\"@\"&Vorgaben!$B$6&\".logineonrw-lms.de\")","v":""}]
["",null,null,"","","",{"$f":"IF(OR(C53=\"\",B53=\"\"),\"\",A53&\"@\"&Vorgaben!$B$6&\".logineonrw-lms.de\")","v":""}]
["",null,null,"","","",{"$f":"IF(OR(C54=\"\",B54=\"\"),\"\",A54&\"@\"&Vorgaben!$B$6&\".logineonrw-lms.de\")","v":""}]
["",null,null,"","","",{"$f":"IF(OR(C55=\"\",B55=\"\"),\"\",A55&\"@\"&Vorgaben!$B$6&\".logineonrw-lms.de\")","v":""}]
["",null,null,"","","",{"$f":"IF(OR(C56=\"\",B56=\"\"),\"\",A56&\"@\"&Vorgaben!$B$6&\".logineonrw-lms.de\")","v":""}]
["",null,null,"","","",{"$f":"IF(OR(C57=\"\",B57=\"\"),\"\",A57&\"@\"&Vorgaben!$B$6&\".logineonrw-lms.de\")","v":""}]
["",null,null,"","","",{"$f":"IF(OR(C58=\"\",B58=\"\"),\"\",A58&\"@\"&Vorgaben!$B$6&\".logineonrw-lms.de\")","v":""}]
["",null,null,"","","",{"$f":"IF(OR(C59=\"\",B59=\"\"),\"\",A59&\"@\"&Vorgaben!$B$6&\".logineonrw-lms.de\")","v":""}]
["",null,null,"","","",{"$f":"IF(OR(C60=\"\",B60=\"\"),\"\",A60&\"@\"&Vorgaben!$B$6&\".logineonrw-lms.de\")","v":""}]
["",null,null,"","","",{"$f":"IF(OR(C61=\"\",B61=\"\"),\"\",A61&\"@\"&Vorgaben!$B$6&\".logineonrw-lms.de\")","v":""}]
["",null,null,"","","",{"$f":"IF(OR(C62=\"\",B62=\"\"),\"\",A62&\"@\"&Vorgaben!$B$6&\".logineonrw-lms.de\")","v":""}]
["",null,null,"","","",{"$f":"IF(OR(C63=\"\",B63=\"\"),\"\",A63&\"@\"&Vorgaben!$B$6&\".logineonrw-lms.de\")","v":""}]
["",null,null,"","","",{"$f":"IF(OR(C64=\"\",B64=\"\"),\"\",A64&\"@\"&Vorgaben!$B$6&\".logineonrw-lms.de\")","v":""}]
["",null,null,"","","",{"$f":"IF(OR(C65=\"\",B65=\"\"),\"\",A65&\"@\"&Vorgaben!$B$6&\".logineonrw-lms.de\")","v":""}]
["",null,null,"","","",{"$f":"IF(OR(C66=\"\",B66=\"\"),\"\",A66&\"@\"&Vorgaben!$B$6&\".logineonrw-lms.de\")","v":""}]
[{"$f":"IF(AND(C67=\"\",B67=\"\"),\"\",SUBSTITUTE(SUBSTITUTE(SUBSTITUTE(SUBSTITUTE(SUBSTITUTE(SUBSTITUTE(LOWER(B67),\"ß\",\"ss\"),\"ä\",\"ae\"),\"ö\",\"oe\"),\"ü\",\"ue\"),\" \",\"-\"),\"é\",\"e\")&\".\"&SUBSTITUTE(SUBSTITUTE(SUBSTITUTE(SUBSTITUTE(SUBSTITUTE(SUBSTITUTE(LOWER(C67),\"ß\",\"ss\"),\"ä\",\"ae\"),\"ö\",\"oe\"),\"ü\",\"ue\"),\" \",\"-\"),\"é\",\"e\"))","v":""},null,null,"","","",{"$f":"IF(OR(C67=\"\",B67=\"\"),\"\",A67&\"@\"&Vorgaben!$B$6&\".logineonrw-lms.de\")","v":""}]
["",null,null,{"$f":"IF(OR(B68=\"\",A68=\"\",$E$2=\"\"),\"\",\"1\")","v":""},{"$f":"IF(OR(B68=\"\",A68=\"\",$E$2=\"\"),\"\",E67)","v":""},{"$f":"IF(OR(C68=\"\",B68=\"\",$F$2=\"\"),\"\",$F$2)","v":""},{"$f":"IF(OR(C68=\"\",B68=\"\"),\"\",A68&\"@\"&Vorgaben!$B$6&\".logineonrw-lms.de\")","v":""}]
["",null,null,"","","",{"$f":"IF(OR(C69=\"\",B69=\"\"),\"\",A69&\"@\"&Vorgaben!$B$6&\".logineonrw-lms.de\")","v":""}]
["",null,null,"","","",{"$f":"IF(OR(C70=\"\",B70=\"\"),\"\",A70&\"@\"&Vorgaben!$B$6&\".logineonrw-lms.de\")","v":""}]
["",null,null,"","","",{"$f":"IF(OR(C71=\"\",B71=\"\"),\"\",A71&\"@\"&Vorgaben!$B$6&\".logineonrw-lms.de\")","v":""}]
["",null,null,"","","",{"$f":"IF(OR(C72=\"\",B72=\"\"),\"\",A72&\"@\"&Vorgaben!$B$6&\".logineonrw-lms.de\")","v":""}]
["",null,null,"","","",{"$f":"IF(OR(C73=\"\",B73=\"\"),\"\",A73&\"@\"&Vorgaben!$B$6&\".logineonrw-lms.de\")","v":""}]
["",null,null,"","","",{"$f":"IF(OR(C74=\"\",B74=\"\"),\"\",A74&\"@\"&Vorgaben!$B$6&\".logineonrw-lms.de\")","v":""}]
["",null,null,"","","",{"$f":"IF(OR(C75=\"\",B75=\"\"),\"\",A75&\"@\"&Vorgaben!$B$6&\".logineonrw-lms.de\")","v":""}]
["",null,null,"","","",{"$f":"IF(OR(C76=\"\",B76=\"\"),\"\",A76&\"@\"&Vorgaben!$B$6&\".logineonrw-lms.de\")","v":""}]
["",null,null,"","","",{"$f":"IF(OR(C77=\"\",B77=\"\"),\"\",A77&\"@\"&Vorgaben!$B$6&\".logineonrw-lms.de\")","v":""}]
["",null,null,"","","",{"$f":"IF(OR(C78=\"\",B78=\"\"),\"\",A78&\"@\"&Vorgaben!$B$6&\".logineonrw-lms.de\")","v":""}]
["",null,null,"","","",{"$f":"IF(OR(C79=\"\",B79=\"\"),\"\",A79&\"@\"&Vorgaben!$B$6&\".logineonrw-lms.de\")","v":""}]
["",null,null,"","","",{"$f":"IF(OR(C80=\"\",B80=\"\"),\"\",A80&\"@\"&Vorgaben!$B$6&\".logineonrw-lms.de\")","v":""}]
["",null,null,"","","",{"$f":"IF(OR(C81=\"\",B81=\"\"),\"\",A81&\"@\"&Vorgaben!$B$6&\".logineonrw-lms.de\")","v":""}]
["",null,null,"","","",{"$f":"IF(OR(C82=\"\",B82=\"\"),\"\",A82&\"@\"&Vorgaben!$B$6&\".logineonrw-lms.de\")","v":""}]
["",null,null,"","","",{"$f":"IF(OR(C83=\"\",B83=\"\"),\"\",A83&\"@\"&Vorgaben!$B$6&\".logineonrw-lms.de\")","v":""}]
["",null,null,"","","",{"$f":"IF(OR(C84=\"\",B84=\"\"),\"\",A84&\"@\"&Vorgaben!$B$6&\".logineonrw-lms.de\")","v":""}]
["",null,null,"","","",{"$f":"IF(OR(C85=\"\",B85=\"\"),\"\",A85&\"@\"&Vorgaben!$B$6&\".logineonrw-lms.de\")","v":""}]
["",null,null,"","","",{"$f":"IF(OR(C86=\"\",B86=\"\"),\"\",A86&\"@\"&Vorgaben!$B$6&\".logineonrw-lms.de\")","v":""}]
["",null,null,"","","",{"$f":"IF(OR(C87=\"\",B87=\"\"),\"\",A87&\"@\"&Vorgaben!$B$6&\".logineonrw-lms.de\")","v":""}]
["",null,null,"","","",{"$f":"IF(OR(C88=\"\",B88=\"\"),\"\",A88&\"@\"&Vorgaben!$B$6&\".logineonrw-lms.de\")","v":""}]
["",null,null,"","","",{"$f":"IF(OR(C89=\"\",B89=\"\"),\"\",A89&\"@\"&Vorgaben!$B$6&\".logineonrw-lms.de\")","v":""}]
["",null,null,"","","",{"$f":"IF(OR(C90=\"\",B90=\"\"),\"\",A90&\"@\"&Vorgaben!$B$6&\".logineonrw-lms.de\")","v":""}]
["",null,null,"","","",{"$f":"IF(OR(C91=\"\",B91=\"\"),\"\",A91&\"@\"&Vorgaben!$B$6&\".logineonrw-lms.de\")","v":""}]
["",null,null,"","","",{"$f":"IF(OR(C92=\"\",B92=\"\"),\"\",A92&\"@\"&Vorgaben!$B$6&\".logineonrw-lms.de\")","v":""}]
["",null,null,"","","",{"$f":"IF(OR(C93=\"\",B93=\"\"),\"\",A93&\"@\"&Vorgaben!$B$6&\".logineonrw-lms.de\")","v":""}]
["",null,null,"","","",{"$f":"IF(OR(C94=\"\",B94=\"\"),\"\",A94&\"@\"&Vorgaben!$B$6&\".logineonrw-lms.de\")","v":""}]
["",null,null,"","","",{"$f":"IF(OR(C95=\"\",B95=\"\"),\"\",A95&\"@\"&Vorgaben!$B$6&\".logineonrw-lms.de\")","v":""}]
["",null,null,"","","",{"$f":"IF(OR(C96=\"\",B96=\"\"),\"\",A96&\"@\"&Vorgaben!$B$6&\".logineonrw-lms.de\")","v":""}]
["",null,null,"","","",{"$f":"IF(OR(C97=\"\",B97=\"\"),\"\",A97&\"@\"&Vorgaben!$B$6&\".logineonrw-lms.de\")","v":""}]
["",null,null,"","","",{"$f":"IF(OR(C98=\"\",B98=\"\"),\"\",A98&\"@\"&Vorgaben!$B$6&\".logineonrw-lms.de\")","v":""}]
["",null,null,"","","",{"$f":"IF(OR(C99=\"\",B99=\"\"),\"\",A99&\"@\"&Vorgaben!$B$6&\".logineonrw-lms.de\")","v":""}]
["",null,null,"","","",{"$f":"IF(OR(C100=\"\",B100=\"\"),\"\",A100&\"@\"&Vorgaben!$B$6&\".logineonrw-lms.de\")","v":""}]

{"sheet":"PDF-Vorlage","index":2,"n_rows":102,"n_cols":5,"rows_kept":102,"cut":false,"hidden":false,"merged":[]}
[null,null,null,"https://SCHULNUMMER.logineonrw-lms.de"]
["Name","Vorname","Benutzername","Passwort","Email"]
[{"$f":"IF(Moodlekurs!C2<>\"\",Moodlekurs!C2,\"\")","v":"Lempel"},{"$f":"IF(Moodlekurs!B2<>\"\",Moodlekurs!B2,\"\")","v":"Lehrer"},{"$f":"IF(Moodlekurs!A2<>\"\",Moodlekurs!A2,\"\")","v":"lehrer.lempel"},{"$f":"IF(Moodlekurs!F2<>\"\",Moodlekurs!F2,\"\")","v":"Neuhinzu2020#"},{"$f":"IF(Moodlekurs!G2<>\"\",Moodlekurs!G2,\"\")","v":"lehrer.lempel@166455.logineonrw-lms.de"}]
[{"$f":"IF(Moodlekurs!C3<>\"\",Moodlekurs!C3,\"\")","v":""},{"$f":"IF(Moodlekurs!B3<>\"\",Moodlekurs!B3,\"\")","v":""},{"$f":"IF(Moodlekurs!A3<>\"\",Moodlekurs!A3,\"\")","v":""},{"$f":"IF(Moodlekurs!F3<>\"\",Moodlekurs!F3,\"\")","v":""},{"$f":"IF(Moodlekurs!G3<>\"\",Moodlekurs!G3,\"\")","v":""}]
[{"$f":"IF(Moodlekurs!C4<>\"\",Moodlekurs!C4,\"\")","v":""},{"$f":"IF(Moodlekurs!B4<>\"\",Moodlekurs!B4,\"\")","v":""},{"$f":"IF(Moodlekurs!A4<>\"\",Moodlekurs!A4,\"\")","v":""},{"$f":"IF(Moodlekurs!F4<>\"\",Moodlekurs!F4,\"\")","v":""},{"$f":"IF(Moodlekurs!G4<>\"\",Moodlekurs!G4,\"\")","v":""}]
[{"$f":"IF(Moodlekurs!C5<>\"\",Moodlekurs!C5,\"\")","v":""},{"$f":"IF(Moodlekurs!B5<>\"\",Moodlekurs!B5,\"\")","v":""},{"$f":"IF(Moodlekurs!A5<>\"\",Moodlekurs!A5,\"\")","v":""},{"$f":"IF(Moodlekurs!F5<>\"\",Moodlekurs!F5,\"\")","v":""},{"$f":"IF(Moodlekurs!G5<>\"\",Moodlekurs!G5,\"\")","v":""}]
[{"$f":"IF(Moodlekurs!C6<>\"\",Moodlekurs!C6,\"\")","v":""},{"$f":"IF(Moodlekurs!B6<>\"\",Moodlekurs!B6,\"\")","v":""},{"$f":"IF(Moodlekurs!A6<>\"\",Moodlekurs!A6,\"\")","v":""},{"$f":"IF(Moodlekurs!F6<>\"\",Moodlekurs!F6,\"\")","v":""},{"$f":"IF(Moodlekurs!G6<>\"\",Moodlekurs!G6,\"\")","v":""}]
[{"$f":"IF(Moodlekurs!C7<>\"\",Moodlekurs!C7,\"\")","v":""},{"$f":"IF(Moodlekurs!B7<>\"\",Moodlekurs!B7,\"\")","v":""},{"$f":"IF(Moodlekurs!A7<>\"\",Moodlekurs!A7,\"\")","v":""},{"$f":"IF(Moodlekurs!F7<>\"\",Moodlekurs!F7,\"\")","v":""},{"$f":"IF(Moodlekurs!G7<>\"\",Moodlekurs!G7,\"\")","v":""}]
[{"$f":"IF(Moodlekurs!C8<>\"\",Moodlekurs!C8,\"\")","v":""},{"$f":"IF(Moodlekurs!B8<>\"\",Moodlekurs!B8,\"\")","v":""},{"$f":"IF(Moodlekurs!A8<>\"\",Moodlekurs!A8,\"\")","v":""},{"$f":"IF(Moodlekurs!F8<>\"\",Moodlekurs!F8,\"\")","v":""},{"$f":"IF(Moodlekurs!G8<>\"\",Moodlekurs!G8,\"\")","v":""}]
[{"$f":"IF(Moodlekurs!C9<>\"\",Moodlekurs!C9,\"\")","v":""},{"$f":"IF(Moodlekurs!B9<>\"\",Moodlekurs!B9,\"\")","v":""},{"$f":"IF(Moodlekurs!A9<>\"\",Moodlekurs!A9,\"\")","v":""},{"$f":"IF(Moodlekurs!F9<>\"\",Moodlekurs!F9,\"\")","v":""},{"$f":"IF(Moodlekurs!G9<>\"\",Moodlekurs!G9,\"\")","v":""}]
[{"$f":"IF(Moodlekurs!C10<>\"\",Moodlekurs!C10,\"\")","v":""},{"$f":"IF(Moodlekurs!B10<>\"\",Moodlekurs!B10,\"\")","v":""},{"$f":"IF(Moodlekurs!A10<>\"\",Moodlekurs!A10,\"\")","v":""},{"$f":"IF(Moodlekurs!F10<>\"\",Moodlekurs!F10,\"\")","v":""},{"$f":"IF(Moodlekurs!G10<>\"\",Moodlekurs!G10,\"\")","v":""}]
[{"$f":"IF(Moodlekurs!C11<>\"\",Moodlekurs!C11,\"\")","v":""},{"$f":"IF(Moodlekurs!B11<>\"\",Moodlekurs!B11,\"\")","v":""},{"$f":"IF(Moodlekurs!A11<>\"\",Moodlekurs!A11,\"\")","v":""},{"$f":"IF(Moodlekurs!F11<>\"\",Moodlekurs!F11,\"\")","v":""},{"$f":"IF(Moodlekurs!G11<>\"\",Moodlekurs!G11,\"\")","v":""}]
[{"$f":"IF(Moodlekurs!C12<>\"\",Moodlekurs!C12,\"\")","v":""},{"$f":"IF(Moodlekurs!B12<>\"\",Moodlekurs!B12,\"\")","v":""},{"$f":"IF(Moodlekurs!A12<>\"\",Moodlekurs!A12,\"\")","v":""},{"$f":"IF(Moodlekurs!F12<>\"\",Moodlekurs!F12,\"\")","v":""},{"$f":"IF(Moodlekurs!G12<>\"\",Moodlekurs!G12,\"\")","v":""}]
[{"$f":"IF(Moodlekurs!C13<>\"\",Moodlekurs!C13,\"\")","v":""},{"$f":"IF(Moodlekurs!B13<>\"\",Moodlekurs!B13,\"\")","v":""},{"$f":"IF(Moodlekurs!A13<>\"\",Moodlekurs!A13,\"\")","v":""},{"$f":"IF(Moodlekurs!F13<>\"\",Moodlekurs!F13,\"\")","v":""},{"$f":"IF(Moodlekurs!G13<>\"\",Moodlekurs!G13,\"\")","v":""}]
[{"$f":"IF(Moodlekurs!C14<>\"\",Moodlekurs!C14,\"\")","v":""},{"$f":"IF(Moodlekurs!B14<>\"\",Moodlekurs!B14,\"\")","v":""},{"$f":"IF(Moodlekurs!A14<>\"\",Moodlekurs!A14,\"\")","v":""},{"$f":"IF(Moodlekurs!F14<>\"\",Moodlekurs!F14,\"\")","v":""},{"$f":"IF(Moodlekurs!G14<>\"\",Moodlekurs!G14,\"\")","v":""}]
[{"$f":"IF(Moodlekurs!C15<>\"\",Moodlekurs!C15,\"\")","v":""},{"$f":"IF(Moodlekurs!B15<>\"\",Moodlekurs!B15,\"\")","v":""},{"$f":"IF(Moodlekurs!A15<>\"\",Moodlekurs!A15,\"\")","v":""},{"$f":"IF(Moodlekurs!F15<>\"\",Moodlekurs!F15,\"\")","v":""},{"$f":"IF(Moodlekurs!G15<>\"\",Moodlekurs!G15,\"\")","v":""}]
[{"$f":"IF(Moodlekurs!C16<>\"\",Moodlekurs!C16,\"\")","v":""},{"$f":"IF(Moodlekurs!B16<>\"\",Moodlekurs!B16,\"\")","v":""},{"$f":"IF(Moodlekurs!A16<>\"\",Moodlekurs!A16,\"\")","v":""},{"$f":"IF(Moodlekurs!F16<>\"\",Moodlekurs!F16,\"\")","v":""},{"$f":"IF(Moodlekurs!G16<>\"\",Moodlekurs!G16,\"\")","v":""}]
[{"$f":"IF(Moodlekurs!C17<>\"\",Moodlekurs!C17,\"\")","v":""},{"$f":"IF(Moodlekurs!B17<>\"\",Moodlekurs!B17,\"\")","v":""},{"$f":"IF(Moodlekurs!A17<>\"\",Moodlekurs!A17,\"\")","v":""},{"$f":"IF(Moodlekurs!F17<>\"\",Moodlekurs!F17,\"\")","v":""},{"$f":"IF(Moodlekurs!G17<>\"\",Moodlekurs!G17,\"\")","v":""}]
[{"$f":"IF(Moodlekurs!C18<>\"\",Moodlekurs!C18,\"\")","v":""},{"$f":"IF(Moodlekurs!B18<>\"\",Moodlekurs!B18,\"\")","v":""},{"$f":"IF(Moodlekurs!A18<>\"\",Moodlekurs!A18,\"\")","v":""},{"$f":"IF(Moodlekurs!F18<>\"\",Moodlekurs!F18,\"\")","v":""},{"$f":"IF(Moodlekurs!G18<>\"\",Moodlekurs!G18,\"\")","v":""}]
[{"$f":"IF(Moodlekurs!C19<>\"\",Moodlekurs!C19,\"\")","v":""},{"$f":"IF(Moodlekurs!B19<>\"\",Moodlekurs!B19,\"\")","v":""},{"$f":"IF(Moodlekurs!A19<>\"\",Moodlekurs!A19,\"\")","v":""},{"$f":"IF(Moodlekurs!F19<>\"\",Moodlekurs!F19,\"\")","v":""},{"$f":"IF(Moodlekurs!G19<>\"\",Moodlekurs!G19,\"\")","v":""}]
[{"$f":"IF(Moodlekurs!C20<>\"\",Moodlekurs!C20,\"\")","v":""},{"$f":"IF(Moodlekurs!B20<>\"\",Moodlekurs!B20,\"\")","v":""},{"$f":"IF(Moodlekurs!A20<>\"\",Moodlekurs!A20,\"\")","v":""},{"$f":"IF(Moodlekurs!F20<>\"\",Moodlekurs!F20,\"\")","v":""},{"$f":"IF(Moodlekurs!G20<>\"\",Moodlekurs!G20,\"\")","v":""}]
[{"$f":"IF(Moodlekurs!C21<>\"\",Moodlekurs!C21,\"\")","v":""},{"$f":"IF(Moodlekurs!B21<>\"\",Moodlekurs!B21,\"\")","v":""},{"$f":"IF(Moodlekurs!A21<>\"\",Moodlekurs!A21,\"\")","v":""},{"$f":"IF(Moodlekurs!F21<>\"\",Moodlekurs!F21,\"\")","v":""},{"$f":"IF(Moodlekurs!G21<>\"\",Moodlekurs!G21,\"\")","v":""}]
[{"$f":"IF(Moodlekurs!C22<>\"\",Moodlekurs!C22,\"\")","v":""},{"$f":"IF(Moodlekurs!B22<>\"\",Moodlekurs!B22,\"\")","v":""},{"$f":"IF(Moodlekurs!A22<>\"\",Moodlekurs!A22,\"\")","v":""},{"$f":"IF(Moodlekurs!F22<>\"\",Moodlekurs!F22,\"\")","v":""},{"$f":"IF(Moodlekurs!G22<>\"\",Moodlekurs!G22,\"\")","v":""}]
[{"$f":"IF(Moodlekurs!C23<>\"\",Moodlekurs!C23,\"\")","v":""},{"$f":"IF(Moodlekurs!B23<>\"\",Moodlekurs!B23,\"\")","v":""},{"$f":"IF(Moodlekurs!A23<>\"\",Moodlekurs!A23,\"\")","v":""},{"$f":"IF(Moodlekurs!F23<>\"\",Moodlekurs!F23,\"\")","v":""},{"$f":"IF(Moodlekurs!G23<>\"\",Moodlekurs!G23,\"\")","v":""}]
[{"$f":"IF(Moodlekurs!C24<>\"\",Moodlekurs!C24,\"\")","v":""},{"$f":"IF(Moodlekurs!B24<>\"\",Moodlekurs!B24,\"\")","v":""},{"$f":"IF(Moodlekurs!A24<>\"\",Moodlekurs!A24,\"\")","v":""},{"$f":"IF(Moodlekurs!F24<>\"\",Moodlekurs!F24,\"\")","v":""},{"$f":"IF(Moodlekurs!G24<>\"\",Moodlekurs!G24,\"\")","v":""}]
[{"$f":"IF(Moodlekurs!C25<>\"\",Moodlekurs!C25,\"\")","v":""},{"$f":"IF(Moodlekurs!B25<>\"\",Moodlekurs!B25,\"\")","v":""},{"$f":"IF(Moodlekurs!A25<>\"\",Moodlekurs!A25,\"\")","v":""},{"$f":"IF(Moodlekurs!F25<>\"\",Moodlekurs!F25,\"\")","v":""},{"$f":"IF(Moodlekurs!G25<>\"\",Moodlekurs!G25,\"\")","v":""}]
[{"$f":"IF(Moodlekurs!C26<>\"\",Moodlekurs!C26,\"\")","v":""},{"$f":"IF(Moodlekurs!B26<>\"\",Moodlekurs!B26,\"\")","v":""},{"$f":"IF(Moodlekurs!A26<>\"\",Moodlekurs!A26,\"\")","v":""},{"$f":"IF(Moodlekurs!F26<>\"\",Moodlekurs!F26,\"\")","v":""},{"$f":"IF(Moodlekurs!G26<>\"\",Moodlekurs!G26,\"\")","v":""}]
[{"$f":"IF(Moodlekurs!C27<>\"\",Moodlekurs!C27,\"\")","v":""},{"$f":"IF(Moodlekurs!B27<>\"\",Moodlekurs!B27,\"\")","v":""},{"$f":"IF(Moodlekurs!A27<>\"\",Moodlekurs!A27,\"\")","v":""},{"$f":"IF(Moodlekurs!F27<>\"\",Moodlekurs!F27,\"\")","v":""},{"$f":"IF(Moodlekurs!G27<>\"\",Moodlekurs!G27,\"\")","v":""}]
[{"$f":"IF(Moodlekurs!C28<>\"\",Moodlekurs!C28,\"\")","v":""},{"$f":"IF(Moodlekurs!B28<>\"\",Moodlekurs!B28,\"\")","v":""},{"$f":"IF(Moodlekurs!A28<>\"\",Moodlekurs!A28,\"\")","v":""},{"$f":"IF(Moodlekurs!F28<>\"\",Moodlekurs!F28,\"\")","v":""},{"$f":"IF(Moodlekurs!G28<>\"\",Moodlekurs!G28,\"\")","v":""}]
[{"$f":"IF(Moodlekurs!C29<>\"\",Moodlekurs!C29,\"\")","v":""},{"$f":"IF(Moodlekurs!B29<>\"\",Moodlekurs!B29,\"\")","v":""},{"$f":"IF(Moodlekurs!A29<>\"\",Moodlekurs!A29,\"\")","v":""},{"$f":"IF(Moodlekurs!F29<>\"\",Moodlekurs!F29,\"\")","v":""},{"$f":"IF(Moodlekurs!G29<>\"\",Moodlekurs!G29,\"\")","v":""}]
[{"$f":"IF(Moodlekurs!C30<>\"\",Moodlekurs!C30,\"\")","v":""},{"$f":"IF(Moodlekurs!B30<>\"\",Moodlekurs!B30,\"\")","v":""},{"$f":"IF(Moodlekurs!A30<>\"\",Moodlekurs!A30,\"\")","v":""},{"$f":"IF(Moodlekurs!F30<>\"\",Moodlekurs!F30,\"\")","v":""},{"$f":"IF(Moodlekurs!G30<>\"\",Moodlekurs!G30,\"\")","v":""}]
[{"$f":"IF(Moodlekurs!C31<>\"\",Moodlekurs!C31,\"\")","v":""},{"$f":"IF(Moodlekurs!B31<>\"\",Moodlekurs!B31,\"\")","v":""},{"$f":"IF(Moodlekurs!A31<>\"\",Moodlekurs!A31,\"\")","v":""},{"$f":"IF(Moodlekurs!F31<>\"\",Moodlekurs!F31,\"\")","v":""},{"$f":"IF(Moodlekurs!G31<>\"\",Moodlekurs!G31,\"\")","v":""}]
[{"$f":"IF(Moodlekurs!C32<>\"\",Moodlekurs!C32,\"\")","v":""},{"$f":"IF(Moodlekurs!B32<>\"\",Moodlekurs!B32,\"\")","v":""},{"$f":"IF(Moodlekurs!A32<>\"\",Moodlekurs!A32,\"\")","v":""},{"$f":"IF(Moodlekurs!F32<>\"\",Moodlekurs!F32,\"\")","v":""},{"$f":"IF(Moodlekurs!G32<>\"\",Moodlekurs!G32,\"\")","v":""}]
[{"$f":"IF(Moodlekurs!C33<>\"\",Moodlekurs!C33,\"\")","v":""},{"$f":"IF(Moodlekurs!B33<>\"\",Moodlekurs!B33,\"\")","v":""},{"$f":"IF(Moodlekurs!A33<>\"\",Moodlekurs!A33,\"\")","v":""},{"$f":"IF(Moodlekurs!F33<>\"\",Moodlekurs!F33,\"\")","v":""},{"$f":"IF(Moodlekurs!G33<>\"\",Moodlekurs!G33,\"\")","v":""}]
[{"$f":"IF(Moodlekurs!C34<>\"\",Moodlekurs!C34,\"\")","v":""},{"$f":"IF(Moodlekurs!B34<>\"\",Moodlekurs!B34,\"\")","v":""},{"$f":"IF(Moodlekurs!A34<>\"\",Moodlekurs!A34,\"\")","v":""},{"$f":"IF(Moodlekurs!F34<>\"\",Moodlekurs!F34,\"\")","v":""},{"$f":"IF(Moodlekurs!G34<>\"\",Moodlekurs!G34,\"\")","v":""}]
[{"$f":"IF(Moodlekurs!C35<>\"\",Moodlekurs!C35,\"\")","v":""},{"$f":"IF(Moodlekurs!B35<>\"\",Moodlekurs!B35,\"\")","v":""},{"$f":"IF(Moodlekurs!A35<>\"\",Moodlekurs!A35,\"\")","v":""},{"$f":"IF(Moodlekurs!F35<>\"\",Moodlekurs!F35,\"\")","v":""},{"$f":"IF(Moodlekurs!G35<>\"\",Moodlekurs!G35,\"\")","v":""}]
[{"$f":"IF(Moodlekurs!C36<>\"\",Moodlekurs!C36,\"\")","v":""},{"$f":"IF(Moodlekurs!B36<>\"\",Moodlekurs!B36,\"\")","v":""},{"$f":"IF(Moodlekurs!A36<>\"\",Moodlekurs!A36,\"\")","v":""},{"$f":"IF(Moodlekurs!F36<>\"\",Moodlekurs!F36,\"\")","v":""},{"$f":"IF(Moodlekurs!G36<>\"\",Moodlekurs!G36,\"\")","v":""}]
[{"$f":"IF(Moodlekurs!C37<>\"\",Moodlekurs!C37,\"\")","v":""},{"$f":"IF(Moodlekurs!B37<>\"\",Moodlekurs!B37,\"\")","v":""},{"$f":"IF(Moodlekurs!A37<>\"\",Moodlekurs!A37,\"\")","v":""},{"$f":"IF(Moodlekurs!F37<>\"\",Moodlekurs!F37,\"\")","v":""},{"$f":"IF(Moodlekurs!G37<>\"\",Moodlekurs!G37,\"\")","v":""}]
[{"$f":"IF(Moodlekurs!C38<>\"\",Moodlekurs!C38,\"\")","v":""},{"$f":"IF(Moodlekurs!B38<>\"\",Moodlekurs!B38,\"\")","v":""},{"$f":"IF(Moodlekurs!A38<>\"\",Moodlekurs!A38,\"\")","v":""},{"$f":"IF(Moodlekurs!F38<>\"\",Moodlekurs!F38,\"\")","v":""},{"$f":"IF(Moodlekurs!G38<>\"\",Moodlekurs!G38,\"\")","v":""}]
[{"$f":"IF(Moodlekurs!C39<>\"\",Moodlekurs!C39,\"\")","v":""},{"$f":"IF(Moodlekurs!B39<>\"\",Moodlekurs!B39,\"\")","v":""},{"$f":"IF(Moodlekurs!A39<>\"\",Moodlekurs!A39,\"\")","v":""},{"$f":"IF(Moodlekurs!F39<>\"\",Moodlekurs!F39,\"\")","v":""},{"$f":"IF(Moodlekurs!G39<>\"\",Moodlekurs!G39,\"\")","v":""}]
[{"$f":"IF(Moodlekurs!C40<>\"\",Moodlekurs!C40,\"\")","v":""},{"$f":"IF(Moodlekurs!B40<>\"\",Moodlekurs!B40,\"\")","v":""},{"$f":"IF(Moodlekurs!A40<>\"\",Moodlekurs!A40,\"\")","v":""},{"$f":"IF(Moodlekurs!F40<>\"\",Moodlekurs!F40,\"\")","v":""},{"$f":"IF(Moodlekurs!G40<>\"\",Moodlekurs!G40,\"\")","v":""}]
[{"$f":"IF(Moodlekurs!C41<>\"\",Moodlekurs!C41,\"\")","v":""},{"$f":"IF(Moodlekurs!B41<>\"\",Moodlekurs!B41,\"\")","v":""},{"$f":"IF(Moodlekurs!A41<>\"\",Moodlekurs!A41,\"\")","v":""},{"$f":"IF(Moodlekurs!F41<>\"\",Moodlekurs!F41,\"\")","v":""},{"$f":"IF(Moodlekurs!G41<>\"\",Moodlekurs!G41,\"\")","v":""}]
[{"$f":"IF(Moodlekurs!C42<>\"\",Moodlekurs!C42,\"\")","v":""},{"$f":"IF(Moodlekurs!B42<>\"\",Moodlekurs!B42,\"\")","v":""},{"$f":"IF(Moodlekurs!A42<>\"\",Moodlekurs!A42,\"\")","v":""},{"$f":"IF(Moodlekurs!F42<>\"\",Moodlekurs!F42,\"\")","v":""},{"$f":"IF(Moodlekurs!G42<>\"\",Moodlekurs!G42,\"\")","v":""}]
[{"$f":"IF(Moodlekurs!C43<>\"\",Moodlekurs!C43,\"\")","v":""},{"$f":"IF(Moodlekurs!B43<>\"\",Moodlekurs!B43,\"\")","v":""},{"$f":"IF(Moodlekurs!A43<>\"\",Moodlekurs!A43,\"\")","v":""},{"$f":"IF(Moodlekurs!F43<>\"\",Moodlekurs!F43,\"\")","v":""},{"$f":"IF(Moodlekurs!G43<>\"\",Moodlekurs!G43,\"\")","v":""}]
[{"$f":"IF(Moodlekurs!C44<>\"\",Moodlekurs!C44,\"\")","v":""},{"$f":"IF(Moodlekurs!B44<>\"\",Moodlekurs!B44,\"\")","v":""},{"$f":"IF(Moodlekurs!A44<>\"\",Moodlekurs!A44,\"\")","v":""},{"$f":"IF(Moodlekurs!F44<>\"\",Moodlekurs!F44,\"\")","v":""},{"$f":"IF(Moodlekurs!G44<>\"\",Moodlekurs!G44,\"\")","v":""}]
[{"$f":"IF(Moodlekurs!C45<>\"\",Moodlekurs!C45,\"\")","v":""},{"$f":"IF(Moodlekurs!B45<>\"\",Moodlekurs!B45,\"\")","v":""},{"$f":"IF(Moodlekurs!A45<>\"\",Moodlekurs!A45,\"\")","v":""},{"$f":"IF(Moodlekurs!F45<>\"\",Moodlekurs!F45,\"\")","v":""},{"$f":"IF(Moodlekurs!G45<>\"\",Moodlekurs!G45,\"\")","v":""}]
[{"$f":"IF(Moodlekurs!C46<>\"\",Moodlekurs!C46,\"\")","v":""},{"$f":"IF(Moodlekurs!B46<>\"\",Moodlekurs!B46,\"\")","v":""},{"$f":"IF(Moodlekurs!A46<>\"\",Moodlekurs!A46,\"\")","v":""},{"$f":"IF(Moodlekurs!F46<>\"\",Moodlekurs!F46,\"\")","v":""},{"$f":"IF(Moodlekurs!G46<>\"\",Moodlekurs!G46,\"\")","v":""}]
[{"$f":"IF(Moodlekurs!C47<>\"\",Moodlekurs!C47,\"\")","v":""},{"$f":"IF(Moodlekurs!B47<>\"\",Moodlekurs!B47,\"\")","v":""},{"$f":"IF(Moodlekurs!A47<>\"\",Moodlekurs!A47,\"\")","v":""},{"$f":"IF(Moodlekurs!F47<>\"\",Moodlekurs!F47,\"\")","v":""},{"$f":"IF(Moodlekurs!G47<>\"\",Moodlekurs!G47,\"\")","v":""}]
[{"$f":"IF(Moodlekurs!C48<>\"\",Moodlekurs!C48,\"\")","v":""},{"$f":"IF(Moodlekurs!B48<>\"\",Moodlekurs!B48,\"\")","v":""},{"$f":"IF(Moodlekurs!A48<>\"\",Moodlekurs!A48,\"\")","v":""},{"$f":"IF(Moodlekurs!F48<>\"\",Moodlekurs!F48,\"\")","v":""},{"$f":"IF(Moodlekurs!G48<>\"\",Moodlekurs!G48,\"\")","v":""}]
[{"$f":"IF(Moodlekurs!C49<>\"\",Moodlekurs!C49,\"\")","v":""},{"$f":"IF(Moodlekurs!B49<>\"\",Moodlekurs!B49,\"\")","v":""},{"$f":"IF(Moodlekurs!A49<>\"\",Moodlekurs!A49,\"\")","v":""},{"$f":"IF(Moodlekurs!F49<>\"\",Moodlekurs!F49,\"\")","v":""},{"$f":"IF(Moodlekurs!G49<>\"\",Moodlekurs!G49,\"\")","v":""}]
[{"$f":"IF(Moodlekurs!C50<>\"\",Moodlekurs!C50,\"\")","v":""},{"$f":"IF(Moodlekurs!B50<>\"\",Moodlekurs!B50,\"\")","v":""},{"$f":"IF(Moodlekurs!A50<>\"\",Moodlekurs!A50,\"\")","v":""},{"$f":"IF(Moodlekurs!F50<>\"\",Moodlekurs!F50,\"\")","v":""},{"$f":"IF(Moodlekurs!G50<>\"\",Moodlekurs!G50,\"\")","v":""}]
[{"$f":"IF(Moodlekurs!C51<>\"\",Moodlekurs!C51,\"\")","v":""},{"$f":"IF(Moodlekurs!B51<>\"\",Moodlekurs!B51,\"\")","v":""},{"$f":"IF(Moodlekurs!A51<>\"\",Moodlekurs!A51,\"\")","v":""},{"$f":"IF(Moodlekurs!F51<>\"\",Moodlekurs!F51,\"\")","v":""},{"$f":"IF(Moodlekurs!G51<>\"\",Moodlekurs!G51,\"\")","v":""}]
[{"$f":"IF(Moodlekurs!C52<>\"\",Moodlekurs!C52,\"\")","v":""},{"$f":"IF(Moodlekurs!B52<>\"\",Moodlekurs!B52,\"\")","v":""},{"$f":"IF(Moodlekurs!A52<>\"\",Moodlekurs!A52,\"\")","v":""},{"$f":"IF(Moodlekurs!F52<>\"\",Moodlekurs!F52,\"\")","v":""},{"$f":"IF(Moodlekurs!G52<>\"\",Moodlekurs!G52,\"\")","v":""}]
[{"$f":"IF(Moodlekurs!C53<>\"\",Moodlekurs!C53,\"\")","v":""},{"$f":"IF(Moodlekurs!B53<>\"\",Moodlekurs!B53,\"\")","v":""},{"$f":"IF(Moodlekurs!A53<>\"\",Moodlekurs!A53,\"\")","v":""},{"$f":"IF(Moodlekurs!F53<>\"\",Moodlekurs!F53,\"\")","v":""},{"$f":"IF(Moodlekurs!G53<>\"\",Moodlekurs!G53,\"\")","v":""}]
[{"$f":"IF(Moodlekurs!C54<>\"\",Moodlekurs!C54,\"\")","v":""},{"$f":"IF(Moodlekurs!B54<>\"\",Moodlekurs!B54,\"\")","v":""},{"$f":"IF(Moodlekurs!A54<>\"\",Moodlekurs!A54,\"\")","v":""},{"$f":"IF(Moodlekurs!F54<>\"\",Moodlekurs!F54,\"\")","v":""},{"$f":"IF(Moodlekurs!G54<>\"\",Moodlekurs!G54,\"\")","v":""}]
[{"$f":"IF(Moodlekurs!C55<>\"\",Moodlekurs!C55,\"\")","v":""},{"$f":"IF(Moodlekurs!B55<>\"\",Moodlekurs!B55,\"\")","v":""},{"$f":"IF(Moodlekurs!A55<>\"\",Moodlekurs!A55,\"\")","v":""},{"$f":"IF(Moodlekurs!F55<>\"\",Moodlekurs!F55,\"\")","v":""},{"$f":"IF(Moodlekurs!G55<>\"\",Moodlekurs!G55,\"\")","v":""}]
[{"$f":"IF(Moodlekurs!C56<>\"\",Moodlekurs!C56,\"\")","v":""},{"$f":"IF(Moodlekurs!B56<>\"\",Moodlekurs!B56,\"\")","v":""},{"$f":"IF(Moodlekurs!A56<>\"\",Moodlekurs!A56,\"\")","v":""},{"$f":"IF(Moodlekurs!F56<>\"\",Moodlekurs!F56,\"\")","v":""},{"$f":"IF(Moodlekurs!G56<>\"\",Moodlekurs!G56,\"\")","v":""}]
[{"$f":"IF(Moodlekurs!C57<>\"\",Moodlekurs!C57,\"\")","v":""},{"$f":"IF(Moodlekurs!B57<>\"\",Moodlekurs!B57,\"\")","v":""},{"$f":"IF(Moodlekurs!A57<>\"\",Moodlekurs!A57,\"\")","v":""},{"$f":"IF(Moodlekurs!F57<>\"\",Moodlekurs!F57,\"\")","v":""},{"$f":"IF(Moodlekurs!G57<>\"\",Moodlekurs!G57,\"\")","v":""}]
[{"$f":"IF(Moodlekurs!C58<>\"\",Moodlekurs!C58,\"\")","v":""},{"$f":"IF(Moodlekurs!B58<>\"\",Moodlekurs!B58,\"\")","v":""},{"$f":"IF(Moodlekurs!A58<>\"\",Moodlekurs!A58,\"\")","v":""},{"$f":"IF(Moodlekurs!F58<>\"\",Moodlekurs!F58,\"\")","v":""},{"$f":"IF(Moodlekurs!G58<>\"\",Moodlekurs!G58,\"\")","v":""}]
[{"$f":"IF(Moodlekurs!C59<>\"\",Moodlekurs!C59,\"\")","v":""},{"$f":"IF(Moodlekurs!B59<>\"\",Moodlekurs!B59,\"\")","v":""},{"$f":"IF(Moodlekurs!A59<>\"\",Moodlekurs!A59,\"\")","v":""},{"$f":"IF(Moodlekurs!F59<>\"\",Moodlekurs!F59,\"\")","v":""},{"$f":"IF(Moodlekurs!G59<>\"\",Moodlekurs!G59,\"\")","v":""}]
[{"$f":"IF(Moodlekurs!C60<>\"\",Moodlekurs!C60,\"\")","v":""},{"$f":"IF(Moodlekurs!B60<>\"\",Moodlekurs!B60,\"\")","v":""},{"$f":"IF(Moodlekurs!A60<>\"\",Moodlekurs!A60,\"\")","v":""},{"$f":"IF(Moodlekurs!F60<>\"\",Moodlekurs!F60,\"\")","v":""},{"$f":"IF(Moodlekurs!G60<>\"\",Moodlekurs!G60,\"\")","v":""}]
[{"$f":"IF(Moodlekurs!C61<>\"\",Moodlekurs!C61,\"\")","v":""},{"$f":"IF(Moodlekurs!B61<>\"\",Moodlekurs!B61,\"\")","v":""},{"$f":"IF(Moodlekurs!A61<>\"\",Moodlekurs!A61,\"\")","v":""},{"$f":"IF(Moodlekurs!F61<>\"\",Moodlekurs!F61,\"\")","v":""},{"$f":"IF(Moodlekurs!G61<>\"\",Moodlekurs!G61,\"\")","v":""}]
[{"$f":"IF(Moodlekurs!C62<>\"\",Moodlekurs!C62,\"\")","v":""},{"$f":"IF(Moodlekurs!B62<>\"\",Moodlekurs!B62,\"\")","v":""},{"$f":"IF(Moodlekurs!A62<>\"\",Moodlekurs!A62,\"\")","v":""},{"$f":"IF(Moodlekurs!F62<>\"\",Moodlekurs!F62,\"\")","v":""},{"$f":"IF(Moodlekurs!G62<>\"\",Moodlekurs!G62,\"\")","v":""}]
[{"$f":"IF(Moodlekurs!C63<>\"\",Moodlekurs!C63,\"\")","v":""},{"$f":"IF(Moodlekurs!B63<>\"\",Moodlekurs!B63,\"\")","v":""},{"$f":"IF(Moodlekurs!A63<>\"\",Moodlekurs!A63,\"\")","v":""},{"$f":"IF(Moodlekurs!F63<>\"\",Moodlekurs!F63,\"\")","v":""},{"$f":"IF(Moodlekurs!G63<>\"\",Moodlekurs!G63,\"\")","v":""}]
[{"$f":"IF(Moodlekurs!C64<>\"\",Moodlekurs!C64,\"\")","v":""},{"$f":"IF(Moodlekurs!B64<>\"\",Moodlekurs!B64,\"\")","v":""},{"$f":"IF(Moodlekurs!A64<>\"\",Moodlekurs!A64,\"\")","v":""},{"$f":"IF(Moodlekurs!F64<>\"\",Moodlekurs!F64,\"\")","v":""},{"$f":"IF(Moodlekurs!G64<>\"\",Moodlekurs!G64,\"\")","v":""}]
[{"$f":"IF(Moodlekurs!C65<>\"\",Moodlekurs!C65,\"\")","v":""},{"$f":"IF(Moodlekurs!B65<>\"\",Moodlekurs!B65,\"\")","v":""},{"$f":"IF(Moodlekurs!A65<>\"\",Moodlekurs!A65,\"\")","v":""},{"$f":"IF(Moodlekurs!F65<>\"\",Moodlekurs!F65,\"\")","v":""},{"$f":"IF(Moodlekurs!G65<>\"\",Moodlekurs!G65,\"\")","v":""}]
[{"$f":"IF(Moodlekurs!C66<>\"\",Moodlekurs!C66,\"\")","v":""},{"$f":"IF(Moodlekurs!B66<>\"\",Moodlekurs!B66,\"\")","v":""},{"$f":"IF(Moodlekurs!A66<>\"\",Moodlekurs!A66,\"\")","v":""},{"$f":"IF(Moodlekurs!F66<>\"\",Moodlekurs!F66,\"\")","v":""},{"$f":"IF(Moodlekurs!G66<>\"\",Moodlekurs!G66,\"\")","v":""}]
[{"$f":"IF(Moodlekurs!C67<>\"\",Moodlekurs!C67,\"\")","v":""},{"$f":"IF(Moodlekurs!B67<>\"\",Moodlekurs!B67,\"\")","v":""},{"$f":"IF(Moodlekurs!A67<>\"\",Moodlekurs!A67,\"\")","v":""},{"$f":"IF(Moodlekurs!F67<>\"\",Moodlekurs!F67,\"\")","v":""},{"$f":"IF(Moodlekurs!G67<>\"\",Moodlekurs!G67,\"\")","v":""}]
[{"$f":"IF(Moodlekurs!C68<>\"\",Moodlekurs!C68,\"\")","v":""},{"$f":"IF(Moodlekurs!B68<>\"\",Moodlekurs!B68,\"\")","v":""},{"$f":"IF(Moodlekurs!A68<>\"\",Moodlekurs!A68,\"\")","v":""},{"$f":"IF(Moodlekurs!F68<>\"\",Moodlekurs!F68,\"\")","v":""},{"$f":"IF(Moodlekurs!G68<>\"\",Moodlekurs!G68,\"\")","v":""}]
[{"$f":"IF(Moodlekurs!C69<>\"\",Moodlekurs!C69,\"\")","v":""},{"$f":"IF(Moodlekurs!B69<>\"\",Moodlekurs!B69,\"\")","v":""},{"$f":"IF(Moodlekurs!A69<>\"\",Moodlekurs!A69,\"\")","v":""},{"$f":"IF(Moodlekurs!F69<>\"\",Moodlekurs!F69,\"\")","v":""},{"$f":"IF(Moodlekurs!G69<>\"\",Moodlekurs!G69,\"\")","v":""}]
[{"$f":"IF(Moodlekurs!C70<>\"\",Moodlekurs!C70,\"\")","v":""},{"$f":"IF(Moodlekurs!B70<>\"\",Moodlekurs!B70,\"\")","v":""},{"$f":"IF(Moodlekurs!A70<>\"\",Moodlekurs!A70,\"\")","v":""},{"$f":"IF(Moodlekurs!F70<>\"\",Moodlekurs!F70,\"\")","v":""},{"$f":"IF(Moodlekurs!G70<>\"\",Moodlekurs!G70,\"\")","v":""}]
[{"$f":"IF(Moodlekurs!C71<>\"\",Moodlekurs!C71,\"\")","v":""},{"$f":"IF(Moodlekurs!B71<>\"\",Moodlekurs!B71,\"\")","v":""},{"$f":"IF(Moodlekurs!A71<>\"\",Moodlekurs!A71,\"\")","v":""},{"$f":"IF(Moodlekurs!F71<>\"\",Moodlekurs!F71,\"\")","v":""},{"$f":"IF(Moodlekurs!G71<>\"\",Moodlekurs!G71,\"\")","v":""}]
[{"$f":"IF(Moodlekurs!C72<>\"\",Moodlekurs!C72,\"\")","v":""},{"$f":"IF(Moodlekurs!B72<>\"\",Moodlekurs!B72,\"\")","v":""},{"$f":"IF(Moodlekurs!A72<>\"\",Moodlekurs!A72,\"\")","v":""},{"$f":"IF(Moodlekurs!F72<>\"\",Moodlekurs!F72,\"\")","v":""},{"$f":"IF(Moodlekurs!G72<>\"\",Moodlekurs!G72,\"\")","v":""}]
[{"$f":"IF(Moodlekurs!C73<>\"\",Moodlekurs!C73,\"\")","v":""},{"$f":"IF(Moodlekurs!B73<>\"\",Moodlekurs!B73,\"\")","v":""},{"$f":"IF(Moodlekurs!A73<>\"\",Moodlekurs!A73,\"\")","v":""},{"$f":"IF(Moodlekurs!F73<>\"\",Moodlekurs!F73,\"\")","v":""},{"$f":"IF(Moodlekurs!G73<>\"\",Moodlekurs!G73,\"\")","v":""}]
[{"$f":"IF(Moodlekurs!C74<>\"\",Moodlekurs!C74,\"\")","v":""},{"$f":"IF(Moodlekurs!B74<>\"\",Moodlekurs!B74,\"\")","v":""},{"$f":"IF(Moodlekurs!A74<>\"\",Moodlekurs!A74,\"\")","v":""},{"$f":"IF(Moodlekurs!F74<>\"\",Moodlekurs!F74,\"\")","v":""},{"$f":"IF(Moodlekurs!G74<>\"\",Moodlekurs!G74,\"\")","v":""}]
[{"$f":"IF(Moodlekurs!C75<>\"\",Moodlekurs!C75,\"\")","v":""},{"$f":"IF(Moodlekurs!B75<>\"\",Moodlekurs!B75,\"\")","v":""},{"$f":"IF(Moodlekurs!A75<>\"\",Moodlekurs!A75,\"\")","v":""},{"$f":"IF(Moodlekurs!F75<>\"\",Moodlekurs!F75,\"\")","v":""},{"$f":"IF(Moodlekurs!G75<>\"\",Moodlekurs!G75,\"\")","v":""}]
[{"$f":"IF(Moodlekurs!C76<>\"\",Moodlekurs!C76,\"\")","v":""},{"$f":"IF(Moodlekurs!B76<>\"\",Moodlekurs!B76,\"\")","v":""},{"$f":"IF(Moodlekurs!A76<>\"\",Moodlekurs!A76,\"\")","v":""},{"$f":"IF(Moodlekurs!F76<>\"\",Moodlekurs!F76,\"\")","v":""},{"$f":"IF(Moodlekurs!G76<>\"\",Moodlekurs!G76,\"\")","v":""}]
[{"$f":"IF(Moodlekurs!C77<>\"\",Moodlekurs!C77,\"\")","v":""},{"$f":"IF(Moodlekurs!B77<>\"\",Moodlekurs!B77,\"\")","v":""},{"$f":"IF(Moodlekurs!A77<>\"\",Moodlekurs!A77,\"\")","v":""},{"$f":"IF(Moodlekurs!F77<>\"\",Moodlekurs!F77,\"\")","v":""},{"$f":"IF(Moodlekurs!G77<>\"\",Moodlekurs!G77,\"\")","v":""}]
[{"$f":"IF(Moodlekurs!C78<>\"\",Moodlekurs!C78,\"\")","v":""},{"$f":"IF(Moodlekurs!B78<>\"\",Moodlekurs!B78,\"\")","v":""},{"$f":"IF(Moodlekurs!A78<>\"\",Moodlekurs!A78,\"\")","v":""},{"$f":"IF(Moodlekurs!F78<>\"\",Moodlekurs!F78,\"\")","v":""},{"$f":"IF(Moodlekurs!G78<>\"\",Moodlekurs!G78,\"\")","v":""}]
[{"$f":"IF(Moodlekurs!C79<>\"\",Moodlekurs!C79,\"\")","v":""},{"$f":"IF(Moodlekurs!B79<>\"\",Moodlekurs!B79,\"\")","v":""},{"$f":"IF(Moodlekurs!A79<>\"\",Moodlekurs!A79,\"\")","v":""},{"$f":"IF(Moodlekurs!F79<>\"\",Moodlekurs!F79,\"\")","v":""},{"$f":"IF(Moodlekurs!G79<>\"\",Moodlekurs!G79,\"\")","v":""}]
[{"$f":"IF(Moodlekurs!C80<>\"\",Moodlekurs!C80,\"\")","v":""},{"$f":"IF(Moodlekurs!B80<>\"\",Moodlekurs!B80,\"\")","v":""},{"$f":"IF(Moodlekurs!A80<>\"\",Moodlekurs!A80,\"\")","v":""},{"$f":"IF(Moodlekurs!F80<>\"\",Moodlekurs!F80,\"\")","v":""},{"$f":"IF(Moodlekurs!G80<>\"\",Moodlekurs!G80,\"\")","v":""}]
[{"$f":"IF(Moodlekurs!C81<>\"\",Moodlekurs!C81,\"\")","v":""},{"$f":"IF(Moodlekurs!B81<>\"\",Moodlekurs!B81,\"\")","v":""},{"$f":"IF(Moodlekurs!A81<>\"\",Moodlekurs!A81,\"\")","v":""},{"$f":"IF(Moodlekurs!F81<>\"\",Moodlekurs!F81,\"\")","v":""},{"$f":"IF(Moodlekurs!G81<>\"\",Moodlekurs!G81,\"\")","v":""}]
[{"$f":"IF(Moodlekurs!C82<>\"\",Moodlekurs!C82,\"\")","v":""},{"$f":"IF(Moodlekurs!B82<>\"\",Moodlekurs!B82,\"\")","v":""},{"$f":"IF(Moodlekurs!A82<>\"\",Moodlekurs!A82,\"\")","v":""},{"$f":"IF(Moodlekurs!F82<>\"\",Moodlekurs!F82,\"\")","v":""},{"$f":"IF(Moodlekurs!G82<>\"\",Moodlekurs!G82,\"\")","v":""}]
[{"$f":"IF(Moodlekurs!C83<>\"\",Moodlekurs!C83,\"\")","v":""},{"$f":"IF(Moodlekurs!B83<>\"\",Moodlekurs!B83,\"\")","v":""},{"$f":"IF(Moodlekurs!A83<>\"\",Moodlekurs!A83,\"\")","v":""},{"$f":"IF(Moodlekurs!F83<>\"\",Moodlekurs!F83,\"\")","v":""},{"$f":"IF(Moodlekurs!G83<>\"\",Moodlekurs!G83,\"\")","v":""}]
[{"$f":"IF(Moodlekurs!C84<>\"\",Moodlekurs!C84,\"\")","v":""},{"$f":"IF(Moodlekurs!B84<>\"\",Moodlekurs!B84,\"\")","v":""},{"$f":"IF(Moodlekurs!A84<>\"\",Moodlekurs!A84,\"\")","v":""},{"$f":"IF(Moodlekurs!F84<>\"\",Moodlekurs!F84,\"\")","v":""},{"$f":"IF(Moodlekurs!G84<>\"\",Moodlekurs!G84,\"\")","v":""}]
[{"$f":"IF(Moodlekurs!C85<>\"\",Moodlekurs!C85,\"\")","v":""},{"$f":"IF(Moodlekurs!B85<>\"\",Moodlekurs!B85,\"\")","v":""},{"$f":"IF(Moodlekurs!A85<>\"\",Moodlekurs!A85,\"\")","v":""},{"$f":"IF(Moodlekurs!F85<>\"\",Moodlekurs!F85,\"\")","v":""},{"$f":"IF(Moodlekurs!G85<>\"\",Moodlekurs!G85,\"\")","v":""}]
[{"$f":"IF(Moodlekurs!C86<>\"\",Moodlekurs!C86,\"\")","v":""},{"$f":"IF(Moodlekurs!B86<>\"\",Moodlekurs!B86,\"\")","v":""},{"$f":"IF(Moodlekurs!A86<>\"\",Moodlekurs!A86,\"\")","v":""},{"$f":"IF(Moodlekurs!F86<>\"\",Moodlekurs!F86,\"\")","v":""},{"$f":"IF(Moodlekurs!G86<>\"\",Moodlekurs!G86,\"\")","v":""}]
[{"$f":"IF(Moodlekurs!C87<>\"\",Moodlekurs!C87,\"\")","v":""},{"$f":"IF(Moodlekurs!B87<>\"\",Moodlekurs!B87,\"\")","v":""},{"$f":"IF(Moodlekurs!A87<>\"\",Moodlekurs!A87,\"\")","v":""},{"$f":"IF(Moodlekurs!F87<>\"\",Moodlekurs!F87,\"\")","v":""},{"$f":"IF(Moodlekurs!G87<>\"\",Moodlekurs!G87,\"\")","v":""}]
[{"$f":"IF(Moodlekurs!C88<>\"\",Moodlekurs!C88,\"\")","v":""},{"$f":"IF(Moodlekurs!B88<>\"\",Moodlekurs!B88,\"\")","v":""},{"$f":"IF(Moodlekurs!A88<>\"\",Moodlekurs!A88,\"\")","v":""},{"$f":"IF(Moodlekurs!F88<>\"\",Moodlekurs!F88,\"\")","v":""},{"$f":"IF(Moodlekurs!G88<>\"\",Moodlekurs!G88,\"\")","v":""}]
[{"$f":"IF(Moodlekurs!C89<>\"\",Moodlekurs!C89,\"\")","v":""},{"$f":"IF(Moodlekurs!B89<>\"\",Moodlekurs!B89,\"\")","v":""},{"$f":"IF(Moodlekurs!A89<>\"\",Moodlekurs!A89,\"\")","v":""},{"$f":"IF(Moodlekurs!F89<>\"\",Moodlekurs!F89,\"\")","v":""},{"$f":"IF(Moodlekurs!G89<>\"\",Moodlekurs!G89,\"\")","v":""}]
[{"$f":"IF(Moodlekurs!C90<>\"\",Moodlekurs!C90,\"\")","v":""},{"$f":"IF(Moodlekurs!B90<>\"\",Moodlekurs!B90,\"\")","v":""},{"$f":"IF(Moodlekurs!A90<>\"\",Moodlekurs!A90,\"\")","v":""},{"$f":"IF(Moodlekurs!F90<>\"\",Moodlekurs!F90,\"\")","v":""},{"$f":"IF(Moodlekurs!G90<>\"\",Moodlekurs!G90,\"\")","v":""}]
[{"$f":"IF(Moodlekurs!C91<>\"\",Moodlekurs!C91,\"\")","v":""},{"$f":"IF(Moodlekurs!B91<>\"\",Moodlekurs!B91,\"\")","v":""},{"$f":"IF(Moodlekurs!A91<>\"\",Moodlekurs!A91,\"\")","v":""},{"$f":"IF(Moodlekurs!F91<>\"\",Moodlekurs!F91,\"\")","v":""},{"$f":"IF(Moodlekurs!G91<>\"\",Moodlekurs!G91,\"\")","v":""}]
[{"$f":"IF(Moodlekurs!C92<>\"\",Moodlekurs!C92,\"\")","v":""},{"$f":"IF(Moodlekurs!B92<>\"\",Moodlekurs!B92,\"\")","v":""},{"$f":"IF(Moodlekurs!A92<>\"\",Moodlekurs!A92,\"\")","v":""},{"$f":"IF(Moodlekurs!F92<>\"\",Moodlekurs!F92,\"\")","v":""},{"$f":"IF(Moodlekurs!G92<>\"\",Moodlekurs!G92,\"\")","v":""}]
[{"$f":"IF(Moodlekurs!C93<>\"\",Moodlekurs!C93,\"\")","v":""},{"$f":"IF(Moodlekurs!B93<>\"\",Moodlekurs!B93,\"\")","v":""},{"$f":"IF(Moodlekurs!A93<>\"\",Moodlekurs!A93,\"\")","v":""},{"$f":"IF(Moodlekurs!F93<>\"\",Moodlekurs!F93,\"\")","v":""},{"$f":"IF(Moodlekurs!G93<>\"\",Moodlekurs!G93,\"\")","v":""}]
[{"$f":"IF(Moodlekurs!C94<>\"\",Moodlekurs!C94,\"\")","v":""},{"$f":"IF(Moodlekurs!B94<>\"\",Moodlekurs!B94,\"\")","v":""},{"$f":"IF(Moodlekurs!A94<>\"\",Moodlekurs!A94,\"\")","v":""},{"$f":"IF(Moodlekurs!F94<>\"\",Moodlekurs!F94,\"\")","v":""},{"$f":"IF(Moodlekurs!G94<>\"\",Moodlekurs!G94,\"\")","v":""}]
[{"$f":"IF(Moodlekurs!C95<>\"\",Moodlekurs!C95,\"\")","v":""},{"$f":"IF(Moodlekurs!B95<>\"\",Moodlekurs!B95,\"\")","v":""},{"$f":"IF(Moodlekurs!A95<>\"\",Moodlekurs!A95,\"\")","v":""},{"$f":"IF(Moodlekurs!F95<>\"\",Moodlekurs!F95,\"\")","v":""},{"$f":"IF(Moodlekurs!G95<>\"\",Moodlekurs!G95,\"\")","v":""}]
[{"$f":"IF(Moodlekurs!C96<>\"\",Moodlekurs!C96,\"\")","v":""},{"$f":"IF(Moodlekurs!B96<>\"\",Moodlekurs!B96,\"\")","v":""},{"$f":"IF(Moodlekurs!A96<>\"\",Moodlekurs!A96,\"\")","v":""},{"$f":"IF(Moodlekurs!F96<>\"\",Moodlekurs!F96,\"\")","v":""},{"$f":"IF(Moodlekurs!G96<>\"\",Moodlekurs!G96,\"\")","v":""}]
[{"$f":"IF(Moodlekurs!C97<>\"\",Moodlekurs!C97,\"\")","v":""},{"$f":"IF(Moodlekurs!B97<>\"\",Moodlekurs!B97,\"\")","v":""},{"$f":"IF(Moodlekurs!A97<>\"\",Moodlekurs!A97,\"\")","v":""},{"$f":"IF(Moodlekurs!F97<>\"\",Moodlekurs!F97,\"\")","v":""},{"$f":"IF(Moodlekurs!G97<>\"\",Moodlekurs!G97,\"\")","v":""}]
[{"$f":"IF(Moodlekurs!C98<>\"\",Moodlekurs!C98,\"\")","v":""},{"$f":"IF(Moodlekurs!B98<>\"\",Moodlekurs!B98,\"\")","v":""},{"$f":"IF(Moodlekurs!A98<>\"\",Moodlekurs!A98,\"\")","v":""},{"$f":"IF(Moodlekurs!F98<>\"\",Moodlekurs!F98,\"\")","v":""},{"$f":"IF(Moodlekurs!G98<>\"\",Moodlekurs!G98,\"\")","v":""}]
[{"$f":"IF(Moodlekurs!C99<>\"\",Moodlekurs!C99,\"\")","v":""},{"$f":"IF(Moodlekurs!B99<>\"\",Moodlekurs!B99,\"\")","v":""},{"$f":"IF(Moodlekurs!A99<>\"\",Moodlekurs!A99,\"\")","v":""},{"$f":"IF(Moodlekurs!F99<>\"\",Moodlekurs!F99,\"\")","v":""},{"$f":"IF(Moodlekurs!G99<>\"\",Moodlekurs!G99,\"\")","v":""}]
[{"$f":"IF(Moodlekurs!C100<>\"\",Moodlekurs!C100,\"\")","v":""},{"$f":"IF(Moodlekurs!B100<>\"\",Moodlekurs!B100,\"\")","v":""},{"$f":"IF(Moodlekurs!A100<>\"\",Moodlekurs!A100,\"\")","v":""},{"$f":"IF(Moodlekurs!F100<>\"\",Moodlekurs!F100,\"\")","v":""},{"$f":"IF(Moodlekurs!G100<>\"\",Moodlekurs!G100,\"\")","v":""}]
[{"$f":"IF(Moodlekurs!C101<>\"\",Moodlekurs!C101,\"\")","v":""},{"$f":"IF(Moodlekurs!B101<>\"\",Moodlekurs!B101,\"\")","v":""},{"$f":"IF(Moodlekurs!A101<>\"\",Moodlekurs!A101,\"\")","v":""},{"$f":"IF(Moodlekurs!F101<>\"\",Moodlekurs!F101,\"\")","v":""},{"$f":"IF(Moodlekurs!G101<>\"\",Moodlekurs!G101,\"\")","v":""}]